program: Gaussian 09
title: 000130095
version: EM64L-G09RevD.01
frameworkgroup: C1[X(C19H29N3O)]
method: RPBEPBE
basis: SDD
operation: Freq
keyword: #p
keyword: freq=noraman
keyword: PBEPBE/SDD
title: #p freq=noraman PBEPBE/SDD
converged: NO YES NO NO
title: Mulliken charges:
elementType: O N N N C C C C C C C C C C C C C C C C C C C H H H H H H H H H H H H H H H H H H H H H H H H H H H H H
charge: -0.474998 -0.084567 -0.060503 -0.381392 -0.016810 0.175209 -0.447494 -0.475290 -0.523967 -0.408659 -0.412006 -0.382641 0.385679 -0.359367 -0.361341 -0.385012 -0.383999 -0.409605 -0.397561 -0.257753 -0.228796 -0.174846 -0.243783 0.180612 0.217177 0.227871 0.211946 0.180574 0.216803 0.210348 0.199844 0.188653 0.192038 0.198653 0.199313 0.189468 0.218636 0.188048 0.201616 0.236253 0.332685 0.212177 0.211129 0.237447 0.261221 0.228180 0.282586 0.223795 0.225174 0.181798 0.227302 0.228156
chargesum: 0.00000
title: Mulliken charges with hydrogens summed into heavy atoms:
elementType: O N N N C C C C C C C C C C C C C C C C C C C
charge: -0.142313 -0.084567 -0.060503 -0.153236 0.163801 0.175209 -0.002445 -0.082770 -0.096816 -0.020163 -0.021315 0.006140 0.385679 0.047317 0.076528 0.038294 0.114670 -0.181425 -0.114974 -0.033959 -0.003623 0.006951 -0.016481
polarizability: 2.59396586e+02 -2.34458504e+01 2.31261200e+02 -1.31579409e+01 -6.63090638e+00 1.74932594e+02
1716.lowfreq: -28.2576 -14.4933 -11.6855 -0.0002 0.0006 0.0007 6.3287 11.2526 29.4216
frequency: -22.6846 6.5204 27.6061 29.5455 42.6786 63.4494 75.1220 101.0512 107.5918 122.0172 185.6028 194.7192 208.2831 209.9458 222.9357 240.1230 245.4161 267.8593 278.7964 285.0718 297.4202 322.0859 334.8802 379.5793 395.9307 404.0815 424.0232 429.4038 465.6465 477.5279 488.3749 502.4461 564.4167 573.5002 616.9850 625.3352 668.9369 708.6106 722.8269 740.1142 750.6753 764.3366 767.8870 785.2450 810.6193 844.7015 851.2985 856.3827 860.7318 881.7677 892.0505 913.0175 926.2702 934.2674 970.5412 980.5108 986.8535 989.7320 989.9559 998.2670 1001.3616 1003.2197 1016.5746 1029.4538 1052.7354 1056.0716 1062.3300 1071.5860 1078.6063 1080.7775 1096.1423 1105.5896 1116.1438 1142.9815 1149.7899 1163.2473 1171.3035 1172.0304 1183.4796 1188.4409 1190.6447 1214.9074 1221.7651 1231.6114 1256.0553 1266.1819 1270.2022 1282.2406 1294.8432 1301.8245 1311.2826 1315.9630 1318.9879 1326.9178 1330.5261 1335.7499 1337.1750 1340.3864 1345.9175 1355.0656 1359.6471 1364.0176 1377.0384 1382.8430 1387.7436 1397.9842 1432.0197 1433.1179 1458.7874 1462.3260 1463.8620 1470.0549 1471.6813 1476.7947 1479.8927 1482.5226 1489.9352 1495.8591 1588.4060 1611.3516 1639.1536 2892.1989 2909.1474 2920.7068 2937.2124 2942.0633 2951.3221 2960.1766 2961.0550 2964.8249 2966.3212 2971.9708 2977.2018 2983.4485 3001.2309 3018.4707 3024.3781 3025.6338 3029.0824 3029.4026 3037.4592 3050.8303 3061.4370 3115.3541 3126.3326 3138.9517 3157.7939 3176.4367 3397.1031 3561.3551
redmass: 3.5168 4.3807 3.0487 4.1097 4.0325 3.4670 3.8723 4.5373 3.2809 3.4888 3.7296 4.8682 2.7163 2.1888 2.1929 2.3929 1.5939 4.7596 2.6180 2.7802 2.3654 2.1981 2.0716 2.4223 3.3116 2.8624 3.5172 2.9874 3.1451 2.9855 2.5071 1.9570 2.6601 3.3917 6.4051 2.7423 4.1444 1.7252 3.7434 1.3122 3.2567 2.2501 2.2846 1.4881 3.0622 2.6609 1.7563 1.5696 1.3559 2.0717 1.4073 2.1249 1.4698 2.1306 2.6193 1.4307 2.3116 3.9948 1.6678 1.7293 2.0445 1.5931 2.1920 2.1064 1.3455 1.8333 1.9147 2.0137 1.4223 1.9621 2.0236 1.3811 2.4488 2.3716 1.7635 1.9394 1.2936 1.2328 1.7241 1.4375 1.2165 1.2353 1.2550 1.4012 1.3028 1.2615 1.9772 1.3129 1.4606 1.5283 1.5138 1.3640 1.3957 1.4142 1.6361 1.3735 1.4014 1.4930 1.4342 1.5157 1.4455 1.5290 2.7931 2.4067 1.7148 1.8757 1.1189 2.1487 1.0893 1.0881 1.0873 1.0823 1.0904 1.0954 1.1098 2.0763 1.1068 1.0862 6.1622 6.0771 4.1847 1.0712 1.0664 1.0644 1.0645 1.0751 1.0695 1.0857 1.0639 1.0599 1.0645 1.0923 1.0683 1.0627 1.0962 1.0969 1.0958 1.0966 1.0930 1.0934 1.1027 1.1014 1.0961 1.0852 1.0872 1.0936 1.0986 1.0955 1.0777 1.0656
irintensity: 0.5161 1.3076 1.1107 2.2382 0.4281 1.2459 0.1648 0.1653 5.9855 4.3053 0.7694 2.3477 34.6867 7.3705 22.9204 57.2765 106.9953 9.1125 8.3419 6.3959 47.7265 24.9994 2.7387 1.3669 2.3934 0.2024 3.0683 0.8665 3.5659 1.5078 4.8126 3.2059 10.6644 16.4075 0.0905 21.8274 19.9711 72.4060 4.9330 59.1397 5.9352 36.6641 8.7741 0.4830 0.1574 10.0004 5.7541 3.3756 3.5474 0.3091 11.3690 0.1355 6.4941 9.7137 25.8769 0.7355 0.8976 0.6228 1.0450 32.4887 35.7271 14.0882 30.9092 7.0071 8.3987 7.8970 16.8167 3.1363 0.5725 3.7926 16.5809 105.8731 0.0804 2.8431 36.5437 19.7094 26.6937 15.0725 22.4310 23.7820 10.3248 2.2467 0.2386 3.1437 0.3873 3.2784 38.3970 11.0381 33.8995 23.2459 6.2706 11.0323 7.8234 35.5695 32.3488 0.3475 7.0341 1.3665 4.5893 14.0193 34.3444 2.6507 2.4305 1.2875 46.2679 50.1781 5.9347 15.7658 4.0010 6.0736 7.5651 17.6808 26.8038 1.4487 21.3658 11.6848 6.6864 4.9792 0.8977 7.1563 341.8257 124.5829 45.8738 73.2637 40.9599 8.1262 35.7584 70.3052 32.6019 34.8208 37.3967 90.3230 43.4340 12.0882 25.1882 57.0342 90.4778 89.3351 9.7923 17.0774 70.6815 54.7063 10.2053 7.7323 2.1193 33.7133 28.0215 6.1838 7.5383 2.0518
temp: 298.150 k
press: 1.00000 atm
elementType: 8 7 7 7 6 6 6 6 6 6 6 6 6 6 6 6 6 6 6 6 6 6 6 1 1 1 1 1 1 1 1 1 1 1 1 1 1 1 1 1 1 1 1 1 1 1 1 1 1 1 1 1
symmnumber: 1
zpe: 1182003.9 jmol-1
zpe.correction: 0.450202 hartree
zpe.thermalcorrener: 0.472234 hartree
zpe.thermalcorrenthalpy: 0.473178 hartree
zpe.thermalcorrgfe: 0.396886 hartree
zpe.sumelectzpe: -979.084899 hartree
zpe.sumelectthermal: -979.062867 hartree
zpe.sumelectthermalent: -979.061923 hartree
zpe.sumelectthermalfe: -979.138215 hartree
dipole: 2.3952 -3.2102 -0.6091
dipole: 4.0513
quadrupole: -148.3445 -129.6332 -138.1487
quadrupole: 7.8330 -7.2922 -4.6434
quadrupole: -9.6357 9.0757 0.5601 7.8330 -7.2922 -4.6434
hfenergy: -979.535101 hartree
pointgroup: C01 [X(C19H29N3O1)]
dipole: -0.8327655 1.3575831 -0.0630728 debye
polarizability: 254.5603994|-27.7134855|232.2744196|12.3288645|13.366572|178.7555615 unknown
InChI: InChI=1S/C19H29N3O/c20-16-22-13-11-21(12-14-22)15-19(23,17-7-3-1-4-8-17)18-9-5-2-6-10-18/h1,3-4,7-8,16,18,20,23H,2,5-6,9-15H2
charge 0 multiplicity 1
52 atoms
O  -0.904838 0.703518 1.613004
N  1.371964 1.203229 -0.340887
N  4.146135 0.734828 0.316497
N  6.135698 -0.532049 0.14913
C  -2.551264 0.766456 -0.266736
C  -1.063765 0.458196 0.156801
C  -3.550668 -0.184603 0.44607
C  -2.965219 2.245645 -0.026077
C  -0.040084 1.390279 -0.614231
C  -5.016029 0.087474 0.031806
C  -4.432117 2.513024 -0.447088
C  -5.412545 1.561211 0.273555
C  -0.699115 -1.011233 -0.075829
C  1.958723 1.719934 0.899311
C  2.205239 0.318195 -1.180718
C  3.464037 1.989122 0.696383
C  3.350686 -0.31142 -0.364738
C  -0.911185 -1.608436 -1.346878
C  -0.0988 -1.787033 0.944939
C  -0.532103 -2.946155 -1.591635
C  0.281569 -3.127209 0.702054
C  5.499925 0.560192 0.525191
C  0.069769 -3.713502 -0.56625
H  -2.624262 0.582092 -1.361335
H  -3.436992 -0.053506 1.54074
H  -3.289494 -1.235633 0.225355
H  -2.304705 2.940846 -0.577742
H  -2.867236 2.485226 1.055235
H  -0.308333 2.441781 -0.367249
H  -0.220627 1.265223 -1.70138
H  -5.692863 -0.58868 0.589518
H  -5.144548 -0.151188 -1.045145
H  -4.526609 2.370519 -1.543887
H  -4.693065 3.569128 -0.239052
H  -6.448699 1.745523 -0.071046
H  -5.392824 1.771294 1.363117
H  1.823483 1.039902 1.770557
H  1.460584 2.678128 1.16033
H  2.6422 0.872745 -2.043846
H  1.594466 -0.505961 -1.592508
H  -0.990259 1.678088 1.765706
H  3.584919 2.765267 -0.089909
H  3.902017 2.380802 1.634909
H  2.935979 -1.02253 0.377685
H  4.038078 -0.880326 -1.014826
H  -1.374964 -1.031746 -2.156657
H  0.055398 -1.330534 1.925866
H  -0.703651 -3.388114 -2.579894
H  0.745564 -3.712599 1.50432
H  5.959812 1.432095 1.036815
H  0.368147 -4.750898 -0.754756
H  7.144173 -0.496805 0.381805
