program: Gaussian 09
title: 000130219
version: EM64L-G09RevD.01
frameworkgroup: C1[X(C17H23N4O9P)]
method: RPBEPBE
basis: SDD
operation: Freq
keyword: #p
keyword: freq=noraman
keyword: PBEPBE/SDD
title: #p freq=noraman PBEPBE/SDD
converged: YES YES NO NO
title: Mulliken charges:
elementType: P O O O O O O O O O N N N N C C C C C C C C C C C C C C C C C H H H H H H H H H H H H H H H H H H H H H H H
charge: 1.382266 -0.246288 -0.287891 -0.241082 -0.358120 -0.325231 -0.517138 -0.708345 -0.665323 -0.647111 -0.312821 -0.197779 -0.386016 -0.630986 -0.341340 0.287639 -0.215767 -0.399457 -0.209881 0.134006 0.230869 -0.337182 -0.090485 -0.120075 -0.530326 0.264079 0.208008 -0.846657 0.324586 -0.360768 -0.265901 0.271465 0.262598 0.272285 0.272675 0.254841 0.279438 0.236422 0.238783 0.249050 0.215904 0.216452 0.290584 0.233743 0.225973 0.365097 0.245712 0.244545 0.321935 0.414888 0.247136 0.234793 0.418236 0.397960
chargesum: 0.00000
title: Mulliken charges with hydrogens summed into heavy atoms:
elementType: P O O O O O O O O O N N N N C C C C C C C C C C C C C C C C C
charge: 1.382266 -0.246288 -0.287891 -0.241082 -0.358120 -0.325231 -0.517138 -0.290110 -0.267363 -0.647111 -0.040536 -0.197779 -0.020919 0.105838 -0.069874 0.287639 0.046831 0.128058 0.069557 0.134006 0.230869 0.138024 -0.090485 -0.120075 0.151079 0.264079 0.208008 -0.096357 0.324586 0.129490 0.216029
polarizability: 4.02081893e+02 1.69903095e+01 2.77325862e+02 4.71265078e+00 -1.01019455e+01 1.78236646e+02
1716.lowfreq: -8.8921 -4.9300 0.0012 0.0013 0.0013 3.3197 23.9103 38.5605 45.1603
frequency: 23.6421 38.3308 45.1177 55.7934 67.2972 73.6066 83.3861 86.6195 93.4977 100.4850 104.7741 122.2128 126.0738 136.8826 144.2524 147.7118 152.9539 170.3329 184.5633 192.9924 201.2625 208.0487 223.9619 235.2299 258.0891 263.1496 273.1588 287.3841 293.8079 308.5161 320.8222 327.2918 328.8097 341.7099 356.0580 367.7757 382.8770 388.2705 406.9472 425.2047 436.1725 453.3109 476.6635 480.5933 501.6659 529.7541 545.8261 558.2353 566.4622 600.5250 607.3404 626.3935 649.4257 676.2484 688.7021 696.6248 713.4539 716.4903 724.6509 734.9335 759.3320 773.0065 782.6132 796.4125 800.7109 828.0934 838.7062 863.6592 879.6702 893.5333 913.0894 923.9559 943.4867 945.7599 969.8700 992.9547 999.1761 1006.6800 1017.4086 1022.2303 1039.8416 1040.5001 1049.7608 1058.3178 1068.9955 1071.7372 1075.7590 1092.2910 1094.4688 1096.9560 1104.3951 1111.4114 1116.0951 1126.5499 1147.8622 1167.6180 1182.7695 1202.5652 1217.0884 1223.6923 1231.1649 1239.0206 1245.7158 1288.8083 1292.6992 1303.8047 1312.1367 1314.7831 1319.0189 1331.4143 1339.3348 1351.5528 1359.2616 1379.4654 1385.3652 1393.5206 1435.5950 1444.4398 1453.5221 1455.0232 1467.1089 1467.9117 1473.1537 1476.0698 1480.1328 1493.3261 1498.4042 1523.2009 1562.1243 1578.5497 1603.6455 1624.5047 1689.3125 2222.2760 2954.8076 2974.5699 2993.1366 3013.6172 3017.1270 3020.5208 3038.2513 3040.7083 3053.5889 3091.0161 3091.3939 3094.8091 3100.2136 3112.0002 3112.2073 3165.0963 3178.0759 3276.4274 3327.3282 3431.3308 3602.1059 3625.8833
redmass: 5.4900 6.5650 5.4221 5.7704 5.1817 3.8765 3.0699 5.8510 3.2153 3.2747 3.5498 4.1730 6.0532 5.6977 5.0455 3.5059 3.2738 2.6677 2.8361 3.8832 4.4616 5.3405 1.3510 2.2885 3.8626 4.0467 5.0145 3.3668 4.1711 6.0432 3.7800 3.3665 4.1963 4.0282 3.3180 9.5322 5.2233 6.0941 6.2158 5.4467 6.3316 4.4216 5.2480 4.6771 4.0369 7.2028 5.0694 4.2424 1.1435 5.8302 5.0808 5.0296 2.4859 2.5733 3.4877 5.7374 4.3725 6.6952 5.6756 3.9782 4.3224 3.9334 4.0352 5.7710 3.7655 3.8597 2.9097 1.5076 3.9105 4.1449 2.9940 2.1799 2.4303 1.7320 3.1196 4.2949 2.6451 2.4805 6.2870 1.2292 1.4485 3.0863 8.0870 2.7468 1.8496 1.8447 2.9801 1.3957 2.1352 2.2463 3.1992 1.3306 1.6169 1.3240 1.6229 1.8273 1.8330 1.9311 1.2746 1.4315 1.2830 1.4228 1.3966 1.6614 1.3360 2.8180 1.5494 1.8463 2.1645 1.1979 1.8307 1.9107 1.2353 1.7051 3.6044 1.2842 1.1288 1.1147 1.0850 1.0861 1.0621 1.8976 1.1110 1.0519 1.9834 1.8822 1.6639 1.7257 9.2616 8.3211 8.2005 1.4045 3.4625 1.1079 1.0330 1.0381 1.0679 1.0590 1.0635 1.0580 1.1030 1.0832 1.0977 1.1066 1.0971 1.1009 1.1066 1.0988 1.0972 1.0894 1.0969 1.0674 1.0757 1.0749 1.0662 1.0873
irintensity: 3.0655 3.8505 0.3133 8.3438 5.6684 10.8053 3.5564 8.2990 33.7334 10.1664 6.7876 5.1933 9.8781 1.4533 3.8293 33.0638 7.3612 8.1187 8.3181 9.1401 12.9709 1.8608 1.0616 1.2876 0.4152 9.4114 4.4067 5.3251 4.2607 60.1247 7.7757 5.4508 7.2815 6.1059 70.1160 74.9378 15.2533 3.1857 19.8298 6.1959 69.4222 14.0073 52.2702 14.7479 12.1552 4.7739 7.6540 35.1187 92.0513 11.3571 4.9733 23.0194 38.8051 127.0143 51.0512 16.6278 35.2720 230.3375 15.2213 44.1932 24.3050 62.9024 21.9869 8.1867 23.5362 83.4816 40.8031 356.5922 57.8088 50.2672 30.5215 17.8532 17.2859 3.8108 41.4182 171.6954 69.2887 20.0450 44.5690 102.5573 0.5574 30.1791 98.9036 55.8097 78.0522 50.3034 33.6548 181.0482 16.9955 59.7643 6.6098 3.5992 18.7853 31.4284 7.1580 10.0193 17.7554 13.3515 22.9930 14.2615 9.8799 44.2274 5.7632 7.5309 10.7947 23.7755 3.8296 114.0102 83.7808 123.2571 22.9952 14.6333 5.0848 102.4392 244.9116 46.4731 15.1892 46.1545 24.6031 66.0730 12.7436 97.2101 43.9473 16.1865 157.3662 244.6315 213.9323 31.7916 124.0033 737.0894 29.5711 42.8045 388.7552 3902.8919 61.0719 32.3258 36.9403 30.1074 20.0756 24.3637 51.3033 3.7612 19.9390 11.1640 3.0584 2.7219 21.9979 17.6402 9.4190 8.4815 21.5430 743.5840 4.8796 143.8660 76.5351 79.3943
temp: 298.150 k
press: 1.00000 atm
elementType: 15 8 8 8 8 8 8 8 8 8 7 7 7 7 6 6 6 6 6 6 6 6 6 6 6 6 6 6 6 6 6 1 1 1 1 1 1 1 1 1 1 1 1 1 1 1 1 1 1 1 1 1 1 1
symmnumber: 1
zpe: 1070185.1 jmol-1
zpe.correction: 0.407612 hartree
zpe.thermalcorrener: 0.438459 hartree
zpe.thermalcorrenthalpy: 0.439403 hartree
zpe.thermalcorrgfe: 0.346818 hartree
zpe.sumelectzpe: -1896.466133 hartree
zpe.sumelectthermal: -1896.435286 hartree
zpe.sumelectthermalent: -1896.434342 hartree
zpe.sumelectthermalfe: -1896.526927 hartree
dipole: 3.0831 0.1751 2.7884
dipole: 4.1607
quadrupole: -177.7593 -177.5638 -198.8134
quadrupole: -23.7187 -6.3332 -15.0699
quadrupole: 6.9529 7.1484 -14.1012 -23.7187 -6.3332 -15.0699
hfenergy: -1896.8737454 hartree
pointgroup: C01 [X(C17H23N4O9P1)]
dipole: 1.1178668 -0.4874314 -1.0919558 debye
polarizability: 392.2835946|-38.9946243|278.4175711|-11.7631955|-27.4335538|186.9432355 unknown
InChI: InChI=1S/C17H23N4O9P/c1-7-11(19-3-4-30-31(25,26)27)14(23)10-8(6-29-16(18)24)17(28-2)15-9(20-15)5-21(17)12(10)13(7)22/h8-9,15,19-20,25-26H,3-6,18H2,1-2H3
charge 0 multiplicity 1
54 atoms
P  -4.644342 1.631398 -0.514204
O  3.717949 0.012202 -2.277807
O  0.733477 3.010053 0.039197
O  1.591564 -3.682443 0.350848
O  -1.233198 0.692208 -1.243195
O  -0.769437 1.758038 1.375285
O  -4.844405 0.45196 0.733372
O  -3.679724 0.956867 -1.706382
O  -6.196806 1.568184 -1.23655
O  -4.19954 3.022663 0.112285
N  4.366959 0.271091 1.508667
N  2.919048 -1.194793 -0.422739
N  -2.439851 -0.918326 0.602294
N  -1.439302 3.680777 0.203394
C  4.445547 0.543892 0.019065
C  3.25212 0.182017 -0.881866
C  4.984985 -0.764946 0.591446
C  4.089564 -1.919918 0.106738
C  1.880175 0.95932 -0.825843
C  1.568271 -1.359222 -0.287059
C  0.892883 -0.181668 -0.603558
C  1.800965 2.028823 0.305111
C  0.881605 -2.632927 0.127843
C  -0.521852 -0.195664 -0.617842
C  4.209078 1.230189 -2.937724
C  -0.555537 -2.550387 0.378137
C  -1.203977 -1.322544 0.164141
C  -1.195161 -3.758578 1.036587
C  -0.545325 2.740332 0.612069
C  -3.630479 -1.647951 1.049681
C  -4.872102 -0.99693 0.400176
H  5.091771 1.377201 -0.263024
H  6.050623 -0.951786 0.739046
H  3.412033 -0.002647 1.817387
H  3.775212 -2.625657 0.892474
H  4.595015 -2.489201 -0.694514
H  1.715726 1.478183 -1.786586
H  2.724483 2.630937 0.332787
H  1.62312 1.560924 1.290529
H  4.3404 0.948626 -3.993637
H  5.18251 1.562252 -2.527588
H  3.480168 2.062759 -2.874599
H  -0.405452 -4.493258 1.264021
H  -1.705856 -3.496376 1.981219
H  -1.927316 -4.260757 0.376168
H  -2.525607 0.101662 0.71148
H  -3.728638 -1.595571 2.151452
H  -3.576641 -2.705783 0.752226
H  -1.129978 4.402185 -0.445443
H  -2.453191 3.533338 0.359581
H  -4.864415 -1.142977 -0.695023
H  -5.80138 -1.400179 0.835169
H  -2.630322 0.821695 -1.51915
H  -6.274616 2.056513 -2.094746
