program: Gaussian 09
title: 000129998
version: EM64L-G09RevD.01
frameworkgroup: C1[X(C14H16Cl2N2O2)]
method: RPBEPBE
basis: SDD
operation: Freq
keyword: #p
keyword: freq=noraman
keyword: PBEPBE/SDD
title: #p freq=noraman PBEPBE/SDD
converged: YES YES NO NO
title: Mulliken charges:
elementType: Cl Cl O O N N C C C C C C C C C C C C C C H H H H H H H H H H H H H H H H
charge: -0.080657 -0.064179 -0.299610 -0.267438 -0.093791 -0.466705 -0.292103 -0.427000 -0.631262 -0.573017 0.036640 0.514731 -0.437429 -0.369933 -0.042739 -0.186879 -0.256296 -0.328123 -0.044369 0.264618 0.225545 0.220138 0.248072 0.223216 0.223102 0.255429 0.198366 0.261821 0.273902 0.253998 0.305091 0.338476 0.234062 0.258650 0.263982 0.261692
chargesum: 0.00000
title: Mulliken charges with hydrogens summed into heavy atoms:
elementType: Cl Cl O O N N C C C C C C C C C C C C C C
charge: -0.080657 -0.064179 -0.299610 -0.267438 -0.093791 -0.128229 0.153580 0.044289 0.045636 -0.037294 0.036640 0.514731 -0.183430 -0.064843 -0.042739 0.047182 0.002354 0.197551 -0.044369 0.264618
polarizability: 3.27611021e+02 4.44943644e+00 1.77981716e+02 -1.51301548e+01 1.33695431e+01 1.08317431e+02
1716.lowfreq: -11.3964 -3.5487 -2.6958 -0.0017 0.0011 0.0021 4.4565 6.0454 13.0740
frequency: -6.7111 5.3639 12.6456 34.3074 43.6978 55.5241 66.6077 76.4962 87.7784 115.9343 136.7951 149.7179 179.3886 184.3430 195.5832 223.2268 238.6539 250.4824 268.8060 277.1355 324.7081 340.5258 361.0534 376.8032 384.0824 408.8163 438.1988 472.3830 536.8455 559.8767 599.1171 645.0227 660.9550 666.1989 684.1325 700.3972 727.7824 776.7924 788.4605 803.2092 827.3918 854.4285 862.1102 898.8979 908.6792 959.2761 971.6548 978.7944 987.9649 993.3302 999.6531 1022.1869 1067.8094 1073.9745 1097.4822 1097.6165 1114.4792 1156.2920 1171.2915 1180.9267 1183.3102 1196.6289 1234.6516 1249.8530 1252.4541 1270.2748 1300.2224 1308.5062 1334.0736 1345.6868 1376.5800 1378.2918 1415.1508 1432.9510 1446.4781 1454.1646 1457.1645 1470.2515 1474.9893 1476.3834 1481.9273 1517.5753 1587.2301 1614.1417 1664.6099 2291.1535 2836.5865 2877.4682 2924.9218 2998.3340 3014.0522 3040.1685 3048.1670 3052.6924 3068.2398 3095.2082 3146.4931 3147.9057 3156.4034 3179.6818 3194.5069 3541.9840
redmass: 3.7792 6.4072 7.9541 5.4833 5.9487 6.2265 4.6491 3.6405 3.4988 4.1433 3.9196 4.2964 3.1758 5.3681 1.3770 3.6128 8.2923 4.2566 3.3507 6.6397 5.1531 2.8426 6.1696 3.5263 3.3865 8.5789 3.0376 6.3995 5.3871 4.1752 6.8920 1.4214 7.5807 6.0643 2.3147 4.9148 8.2216 1.1600 1.3197 5.2808 4.3454 5.3680 1.5838 9.0856 1.3669 1.7639 1.6697 5.9189 1.3156 2.9301 2.3626 2.0627 3.5177 2.0481 1.4582 1.4383 1.5088 3.6438 1.5724 1.0885 2.9380 1.0807 1.5732 1.7383 1.2392 1.4677 1.3133 1.5201 1.3860 1.4739 1.6621 3.1059 3.1225 1.1585 1.0778 1.0938 1.0805 1.0512 2.5487 1.0779 1.0630 2.3023 5.0290 6.5005 8.7427 11.7719 1.0702 1.0556 1.0685 1.0564 1.0855 1.0745 1.0926 1.1053 1.0571 1.1012 1.0921 1.0895 1.1119 1.0952 1.0959 1.0763
irintensity: 0.1229 0.3961 0.3862 0.4848 0.0875 3.7303 0.5034 0.5961 5.4574 1.6756 8.2467 2.1128 5.1995 1.4607 6.9832 6.4484 3.0840 4.2922 2.6188 21.5061 1.4995 16.5294 1.9862 0.5443 0.5681 5.4765 7.6704 2.3892 0.3416 3.9288 3.0104 42.1276 19.7941 96.4875 31.4968 47.0990 14.3086 9.5244 55.5132 17.1187 27.2225 141.3414 48.5653 10.1336 3.9618 5.7604 0.3725 14.0687 3.5586 280.0349 137.9577 33.9476 23.5936 30.1061 26.5880 11.7805 10.5819 706.4408 18.9891 0.9898 4.4339 2.2704 4.7130 10.5696 23.9708 6.4456 7.9609 28.9127 52.8880 102.7806 60.2383 33.7280 81.4203 10.0628 3.7014 3.6114 17.6464 15.1293 101.8105 6.3307 20.1399 461.6892 174.7673 175.1332 236.7536 9.8098 77.8912 100.0365 66.5492 13.1487 10.9006 27.2620 15.6433 8.0493 22.2418 26.2203 8.6858 5.5850 15.6397 2.3666 5.6209 31.8280
temp: 298.150 k
press: 1.00000 atm
elementType: 17 17 8 8 7 7 6 6 6 6 6 6 6 6 6 6 6 6 6 6 1 1 1 1 1 1 1 1 1 1 1 1 1 1 1 1
symmnumber: 1
zpe: 721465.5 jmol-1
zpe.correction: 0.274792 hartree
zpe.thermalcorrener: 0.295615 hartree
zpe.thermalcorrenthalpy: 0.296559 hartree
zpe.thermalcorrgfe: 0.219399 hartree
zpe.sumelectzpe: -1721.604669 hartree
zpe.sumelectthermal: -1721.583845 hartree
zpe.sumelectthermalent: -1721.582901 hartree
zpe.sumelectthermalfe: -1721.660062 hartree
dipole: 0.1553 0.4592 0.6528
dipole: 0.8131
quadrupole: -168.3825 -132.8546 -130.4769
quadrupole: -6.1219 -5.8764 0.2882
quadrupole: -24.4779 11.0501 13.4278 -6.1219 -5.8764 0.2882
hfenergy: -1721.8794606 hartree
pointgroup: C01 [X(C14H16Cl2N2O2)]
dipole: 0.0443415 0.0189576 0.3162554 debye
polarizability: 328.1600696|10.0929244|146.861327|-0.5761629|37.698116|138.8887715 unknown
InChI: InChI=1S/C14H16Cl2N2O2/c1-18(9-7-15)8-2-3-10-20-14(19)17-13-6-4-5-12(16)11-13/h4-6,11,17H,7-10H2,1H3
charge 0 multiplicity 1
36 atoms
Cl -9.345203 0.797245 -0.313536
Cl 6.876246 2.15538 1.990318
O  0.3414 -0.700732 0.133614
O  1.906916 -1.837954 -1.214851
N  -5.244401 0.400004 0.12607
N  2.519861 -0.152785 0.345741
C  -6.671592 0.514047 0.509115
C  -4.458459 -0.497689 1.012168
C  -4.587388 1.702137 -0.111786
C  -7.521579 0.547277 -0.768996
C  -3.136078 -0.847028 0.461907
C  3.931113 -0.081349 0.202985
C  4.616316 0.850996 1.028658
C  4.657966 -0.888566 -0.712211
C  6.012131 0.95439 0.92086
C  6.059731 -0.750144 -0.787027
C  6.762517 0.170119 0.024654
C  -0.723349 -1.536875 -0.51044
C  -2.01763 -1.145612 0.037984
C  1.643106 -0.981269 -0.335525
H  -6.96976 -0.36354 1.110603
H  -6.880633 1.418447 1.125015
H  -5.038567 -1.428465 1.160826
H  -4.29967 -0.05255 2.029073
H  -5.178487 2.296781 -0.828683
H  -3.588806 1.537771 -0.550179
H  -4.466626 2.303534 0.82311
H  -7.266429 1.389943 -1.427984
H  -7.469246 -0.402525 -1.318528
H  4.070885 1.481092 1.739329
H  4.127684 -1.603534 -1.343611
H  2.07997 0.469746 1.027304
H  6.619645 -1.372575 -1.492999
H  7.848878 0.27269 -0.037296
H  -0.678683 -1.378787 -1.604037
H  -0.497379 -2.60132 -0.312749
