program: Gaussian 09
title: 000129997
version: EM64L-G09RevD.01
frameworkgroup: C1[X(C15H15N3O4)]
method: RPBEPBE
basis: SDD
operation: Freq
keyword: #p
keyword: freq=noraman
keyword: PBEPBE/SDD
title: #p freq=noraman PBEPBE/SDD
converged: YES YES NO NO
title: Mulliken charges:
elementType: O O O O N N N C C C C C C C C C C C C C C C H H H H H H H H H H H H H H H
charge: -0.254645 -0.156656 -0.232877 -0.246667 -0.210358 -0.137942 0.050436 -0.178181 -0.386000 -0.417309 -0.377729 0.134050 -0.473528 0.209569 0.184682 -0.087433 0.260934 -0.140619 -0.092965 -0.822681 0.297167 -0.750595 0.293973 0.249759 0.264509 0.245374 0.248911 0.259757 0.268256 0.251446 0.259813 0.233255 0.279182 0.222921 0.257833 0.248215 0.246147
chargesum: 0.00000
title: Mulliken charges with hydrogens summed into heavy atoms:
elementType: O O O O N N N C C C C C C C C C C C C C C C
charge: -0.254645 -0.156656 -0.232877 -0.246667 -0.210358 -0.137942 0.050436 0.115792 0.128268 0.076976 0.150284 0.134050 0.037731 0.209569 0.184682 -0.087433 0.260934 -0.140619 -0.092965 -0.087325 0.297167 0.001599
polarizability: 3.05775575e+02 2.54489284e+01 2.14194149e+02 -7.63181728e+00 1.01212507e+01 1.20468093e+02
1716.lowfreq: -3.3063 -0.0009 -0.0006 0.0002 3.9552 8.8813 29.1342 32.6852 44.3725
frequency: 29.1262 32.6518 44.3497 57.9954 64.3157 91.3203 110.9648 118.8497 127.7055 133.4701 136.3566 164.2332 179.2679 187.9587 196.1163 245.4183 276.1067 286.9032 316.2669 330.0359 352.3146 363.5577 391.8165 422.9230 452.2716 456.3115 490.6306 508.1778 563.0242 583.5511 621.7665 648.6680 683.0265 708.2503 723.0513 741.0376 760.3668 775.2339 788.0967 798.9486 843.7672 849.1600 859.8252 908.6975 919.7317 927.7204 961.9352 980.1828 991.9496 1007.8257 1020.5935 1035.6105 1042.5589 1051.0385 1062.5681 1072.2004 1096.9159 1110.3702 1114.7873 1135.5001 1157.0541 1177.6543 1183.0958 1190.4206 1211.4468 1240.1997 1261.9998 1310.2248 1318.4951 1324.1604 1349.8133 1353.7722 1384.5469 1390.2907 1410.6163 1441.2409 1452.8093 1454.3810 1456.2504 1458.8215 1462.6726 1472.7324 1477.5918 1485.9792 1490.8009 1512.0527 1534.3046 1564.8411 1600.3494 1649.8929 2975.0879 3007.9530 3032.8724 3035.5699 3047.8699 3075.2477 3086.4662 3094.0780 3099.7887 3100.3931 3101.8741 3116.9163 3142.2432 3181.8771 3202.6023
redmass: 6.2747 5.3657 3.7095 1.1219 4.9864 4.3470 3.7551 2.4733 2.7774 2.9547 1.3394 3.5129 5.0985 4.8100 6.4553 4.9000 4.4927 3.9802 3.9507 4.0896 6.6619 7.2994 5.0337 7.1898 5.7216 3.7194 8.6085 8.0707 3.5577 4.7932 5.2659 7.1410 3.8173 5.6443 5.5796 9.7380 3.4062 4.8739 1.4595 2.1892 5.8504 6.1891 2.7148 5.1232 4.1564 3.6513 2.8196 1.6087 1.8419 1.9818 2.4034 1.5071 1.6679 3.2896 2.2071 2.1088 1.4427 1.4214 1.4690 1.5134 3.7474 1.5556 1.3116 2.8284 3.7060 1.5927 2.0975 1.4972 1.2335 5.2769 2.4150 7.1672 1.2367 1.2677 4.7847 4.4757 1.0576 1.0562 1.2779 1.1032 1.1411 1.8009 1.0851 1.1932 2.2509 6.7887 10.8652 9.3007 11.4276 9.7603 1.0379 1.0379 1.0615 1.0660 1.0967 1.0519 1.0871 1.0570 1.0973 1.0948 1.1016 1.1031 1.1023 1.1184 1.1176
irintensity: 0.6794 1.5425 1.9827 0.5672 7.7602 1.6498 4.6770 1.2433 4.9585 2.1490 1.6605 4.3821 1.5651 16.0476 4.4121 0.6104 8.3046 17.1678 3.3945 1.4836 5.9202 12.9218 15.1342 0.5877 2.9597 8.5184 2.3403 11.0280 2.5062 3.4393 15.4424 8.7862 1.3336 3.1517 2.9335 2.4760 2.0211 1.0026 21.2589 32.9510 38.4845 9.0143 5.5077 1.1170 77.3185 56.1967 2.0283 96.6350 88.6854 57.2298 17.3036 1.9954 14.0300 5.1925 22.1270 58.2236 26.2460 42.0063 83.4410 1.2565 22.4206 80.5958 13.7059 434.5126 4.7334 1.3489 13.9745 7.7471 17.0437 139.1304 7.7578 41.8381 50.9499 26.7158 145.1070 147.4613 24.1501 22.1689 12.9492 20.2785 4.0549 75.9304 17.6071 5.4599 14.9238 14.1403 113.0839 577.9437 11.5043 231.6671 25.8748 1.4555 11.3239 14.3518 18.0879 28.7288 3.7411 24.2310 2.6175 6.9620 3.8799 18.7743 10.4622 4.3964 18.2251
temp: 298.150 k
press: 1.00000 atm
elementType: 8 8 8 8 7 7 7 6 6 6 6 6 6 6 6 6 6 6 6 6 6 6 1 1 1 1 1 1 1 1 1 1 1 1 1 1 1
symmnumber: 1
zpe: 735911.1 jmol-1
zpe.correction: 0.280294 hartree
zpe.thermalcorrener: 0.300786 hartree
zpe.thermalcorrenthalpy: 0.301730 hartree
zpe.thermalcorrgfe: 0.229504 hartree
zpe.sumelectzpe: -1044.106034 hartree
zpe.sumelectthermal: -1044.085543 hartree
zpe.sumelectthermalent: -1044.084598 hartree
zpe.sumelectthermalfe: -1044.156824 hartree
dipole: -1.7105 1.4596 3.0191
dipole: 3.7644
quadrupole: -103.4421 -137.1886 -123.9798
quadrupole: 9.6344 3.6129 -10.2632
quadrupole: 18.0947 -15.6518 -2.4429 9.6344 3.6129 -10.2632
hfenergy: -1044.3863282 hartree
pointgroup: C01 [X(C15H15N3O4)]
dipole: 0.6498276 0.6816127 -1.1430797 debye
polarizability: 305.8939741|-23.8721869|214.7897412|-12.5595357|-1.5833857|119.7541023 unknown
InChI: InChI=1S/C15H15N3O4/c1-7-11(17-5-6-17)14(21)10-12(13(7)20)18-4-3-9(15(18)16-10)22-8(2)19/h9H,3-6H2,1-2H3
charge 0 multiplicity 1
37 atoms
O  -3.73084 -0.496488 -0.610415
O  2.042633 -2.471154 0.425879
O  1.201736 2.979424 -0.274476
O  -5.760032 -0.716902 0.523574
N  -1.010926 1.011646 0.262007
N  4.216732 -0.819528 -0.047454
N  -0.751236 -1.236295 0.586915
C  -3.103434 -0.021232 0.673416
C  4.705468 -2.115915 -0.548481
C  5.323375 -0.794959 -1.035601
C  -1.947137 2.151467 0.197131
C  -1.626802 -0.212916 0.538263
C  -3.239102 1.527355 0.821675
C  0.337702 0.773683 0.119089
C  2.954906 -0.25295 -0.045961
C  0.48365 -0.62044 0.324551
C  2.774507 1.12671 -0.209292
C  1.813126 -1.236581 0.259124
C  1.432925 1.722882 -0.136169
C  3.945924 2.064409 -0.4014
C  -5.090152 -0.848493 -0.524713
C  -5.570881 -1.412732 -1.841889
H  -3.573523 -0.572112 1.502533
H  5.246175 -2.729329 0.1788
H  4.059797 -2.676047 -1.232271
H  5.084096 -0.472347 -2.05631
H  6.301296 -0.478944 -0.658684
H  -2.08468 2.462055 -0.852852
H  -1.553251 3.009764 0.762426
H  -3.296331 1.777528 1.895357
H  -4.158213 1.893311 0.339366
H  4.703461 1.914953 0.390855
H  3.588038 3.10574 -0.366386
H  4.455121 1.915433 -1.372437
H  -5.26027 -2.470698 -1.918719
H  -5.120372 -0.872443 -2.689457
H  -6.668685 -1.363552 -1.889395
