program: Gaussian 09
title: 000129965
version: EM64L-G09RevD.01
frameworkgroup: C1[X(C12H11N3O2)]
method: RPBEPBE
basis: SDD
operation: Freq
keyword: #p
keyword: freq=noraman
keyword: PBEPBE/SDD
title: #p freq=noraman PBEPBE/SDD
converged: NO YES NO NO
title: Mulliken charges:
elementType: O O N N N C C C C C C C C C C C C H H H H H H H H H H H
charge: -0.190174 -0.202017 -0.205429 -0.091300 -0.051667 -0.574891 -0.370979 0.503721 -0.423234 -0.516464 -0.320659 0.193156 0.180075 0.276704 -0.385549 -0.249798 -0.253115 0.254405 0.218720 0.245865 0.243655 0.232912 0.233038 0.235091 0.226537 0.243108 0.274285 0.274003
chargesum: 0.00000
title: Mulliken charges with hydrogens summed into heavy atoms:
elementType: O O N N N C C C C C C C C C C C C
charge: -0.190174 -0.202017 -0.205429 -0.091300 -0.051667 -0.101766 0.118540 0.503721 -0.190322 -0.048335 -0.094122 0.193156 0.180075 0.276704 -0.142440 0.024488 0.020888
polarizability: 2.13734367e+02 -4.15835084e+01 1.39397967e+02 -1.20743377e+01 3.13317421e-01 1.40705655e+02
1716.lowfreq: -10.9365 -6.0689 -0.0005 -0.0005 0.0008 5.9303 14.7479 20.2643 36.1245
frequency: 12.6739 19.4679 35.9546 46.6316 107.3483 115.5830 156.6255 163.1181 201.3264 247.9031 273.8681 294.0203 341.0967 346.5598 374.3540 394.9168 451.2844 480.7632 548.8415 554.7765 587.4780 600.9015 620.2796 629.1298 668.0815 688.3597 700.3501 735.9005 737.6987 753.5240 791.5345 818.1375 909.0472 922.2328 932.9875 938.0039 938.3289 956.3793 957.8839 1008.9058 1030.4398 1071.1393 1108.5294 1125.1792 1167.0043 1182.9042 1187.8970 1215.5315 1246.9592 1277.1660 1283.7320 1293.7715 1328.3648 1339.5272 1349.8693 1355.1682 1375.3212 1438.8017 1461.8750 1466.9684 1471.9463 1567.3589 1579.2379 1618.8512 1659.8423 1672.1371 1993.6439 2923.5318 2949.9504 2983.9715 3013.7975 3059.4050 3080.5744 3117.5848 3132.1714 3158.5398 3203.9223 3232.6536
redmass: 7.0538 8.9331 3.7967 5.3920 6.6326 6.2112 5.5974 5.7681 3.1758 4.7843 2.7441 4.2801 6.1841 2.6465 4.2261 4.4808 7.3747 3.2070 4.0456 6.7561 6.7056 6.1919 2.8980 2.2899 3.5155 6.7250 4.5496 6.7645 4.8420 1.5407 1.2011 2.0160 2.4435 2.2909 1.3910 2.1648 1.5329 2.4113 2.2006 2.1152 1.5813 2.3220 2.4170 2.4509 1.3520 2.0336 1.1108 1.3102 2.9252 1.6468 1.7287 2.0371 1.5602 2.0049 1.7621 1.7034 1.9364 2.2448 1.1051 1.1518 1.1110 7.0352 6.8971 11.2292 6.5115 10.5745 13.6622 1.0587 1.1006 1.0642 1.0601 1.0991 1.1025 1.0908 1.0858 1.0987 1.0894 1.1106
irintensity: 0.0783 0.8394 0.2905 0.5454 3.1461 11.3021 2.0492 0.5495 0.9533 0.7199 3.5462 0.9481 13.2271 3.0827 7.0653 9.9506 7.1622 10.0870 0.1813 6.2602 2.8334 0.9869 11.0048 0.9169 4.7250 22.3490 10.5363 0.7497 2.8004 41.0380 9.7106 78.7486 16.3852 6.5668 2.0089 9.3495 2.5712 6.1128 7.3294 9.0396 11.5960 6.9631 31.9640 6.5977 4.6250 11.7235 1.6900 2.5357 1.2141 16.5355 5.8389 22.0442 2.5822 25.6925 34.4987 65.8259 68.6422 0.6962 33.8394 9.0787 20.5143 111.5172 2.9593 413.5813 19.6873 13.1051 637.9766 40.5529 22.0949 23.4413 37.1371 8.2744 9.8316 10.9347 0.6175 10.6523 0.0106 0.8116
temp: 298.150 k
press: 1.00000 atm
elementType: 8 8 7 7 7 6 6 6 6 6 6 6 6 6 6 6 6 1 1 1 1 1 1 1 1 1 1 1
symmnumber: 1
zpe: 549011.3 jmol-1
zpe.correction: 0.209107 hartree
zpe.thermalcorrener: 0.224434 hartree
zpe.thermalcorrenthalpy: 0.225378 hartree
zpe.thermalcorrgfe: 0.163168 hartree
zpe.sumelectzpe: -777.294960 hartree
zpe.sumelectthermal: -777.279633 hartree
zpe.sumelectthermalent: -777.278689 hartree
zpe.sumelectthermalfe: -777.340899 hartree
dipole: 1.4874 0.0834 -0.7239
dipole: 1.6563
quadrupole: -111.9057 -95.6394 -97.6052
quadrupole: 11.0275 1.5453 -9.9935
quadrupole: -10.1890 6.0774 4.1116 11.0275 1.5453 -9.9935
hfenergy: -777.504067 hartree
pointgroup: C01 [X(C12H11N3O2)]
dipole: -0.6006659 -0.1007945 -0.2316562 debye
polarizability: 215.3062148|-37.6368935|140.1283244|18.345629|1.9977484|138.4034489 unknown
InChI: InChI=1S/C12H11N3O2/c13-14-10-3-1-9(2-4-10)7-8-15-11(16)5-6-12(15)17/h1-3,5-6H,4,7-8H2
charge 0 multiplicity 1
28 atoms
O  -1.186205 -0.878623 2.377028
O  -3.472878 0.561351 -1.465755
N  -2.214634 0.210171 0.523852
N  4.149898 -0.824476 -0.29629
N  5.1728 -1.436805 -0.326227
C  -0.759681 2.109936 -0.268695
C  -1.77644 1.588835 0.78507
C  0.528357 1.30378 -0.325069
C  0.851274 0.556707 -1.427477
C  2.116873 -0.277953 -1.557674
C  1.429184 1.337966 0.836368
C  -1.865578 -0.913977 1.3223
C  -3.006605 -0.197397 -0.57777
C  3.001206 -0.160191 -0.306191
C  2.615654 0.639096 0.839366
C  -2.495269 -2.112569 0.655302
C  -3.164529 -1.693787 -0.453199
H  -1.25174 2.124145 -1.256909
H  -0.536556 3.162281 0.00031
H  -1.334464 1.585868 1.797292
H  -2.663926 2.247496 0.791368
H  0.178178 0.542121 -2.295002
H  1.84369 -1.340782 -1.7391
H  2.68036 0.040562 -2.46155
H  1.152285 1.933981 1.71286
H  3.289357 0.6698 1.70264
H  -2.390056 -3.118146 1.062705
H  -3.740554 -2.273591 -1.174552
