program: Gaussian 09
title: 000129941
version: EM64L-G09RevD.01
frameworkgroup: C1[X(C9H9N3OS)]
method: RPBEPBE
basis: SDD
operation: Freq
keyword: #p
keyword: freq=noraman
keyword: PBEPBE/SDD
title: #p freq=noraman PBEPBE/SDD
converged: YES YES NO NO
title: Mulliken charges:
elementType: S O N N N C C C C C C C C C H H H H H H H H H
charge: 0.269071 -0.176977 -0.021292 -0.345043 0.003257 -0.626632 0.201251 0.346330 -0.616615 -0.321607 -0.285488 -0.080304 -0.353542 -0.342440 0.288294 0.248422 0.245027 0.233456 0.222185 0.270099 0.354039 0.242875 0.245633
chargesum: 0.00000
title: Mulliken charges with hydrogens summed into heavy atoms:
elementType: S O N N N C C C C C C C C C
charge: 0.269071 -0.176977 -0.021292 0.008996 0.003257 -0.338338 0.201251 0.346330 0.110290 -0.099422 -0.015390 -0.080304 -0.110667 -0.096806
polarizability: 2.20562901e+02 1.49836404e+01 1.32876572e+02 1.82978093e-01 -6.23693445e+00 7.59879610e+01
1716.lowfreq: -10.8121 -5.8832 -0.0008 0.0008 0.0013 8.7175 43.3530 58.7187 91.1823
frequency: 43.3004 58.6399 91.1655 125.9147 153.8756 223.8830 232.8696 251.0300 300.9253 338.8620 361.5277 368.4164 423.4006 435.3765 495.3407 535.6236 564.8354 591.0961 638.8063 662.0235 666.9352 699.5959 719.1174 745.1648 803.1759 831.9807 883.5628 959.6149 964.0405 979.4911 987.1781 989.4613 1044.8054 1058.7100 1069.8843 1084.3932 1116.7794 1151.9597 1221.3038 1246.2282 1267.9474 1300.2827 1322.4532 1345.1560 1393.1108 1403.1306 1425.5734 1461.9038 1468.8493 1471.6839 1533.3533 1563.2734 1585.4462 1625.4428 2987.5317 3065.1373 3084.2240 3105.0375 3131.8960 3140.4312 3157.4406 3182.1835 3521.6785
redmass: 4.4296 6.0496 6.2136 5.1490 5.4962 3.8844 1.2227 3.1755 6.8821 7.8268 7.8646 2.5406 5.5377 8.2443 5.5179 5.7326 4.6251 6.7061 4.5636 6.5978 4.8322 2.1159 2.5970 3.0316 3.3593 1.5739 1.2615 5.2013 1.5248 2.6148 1.7383 1.9641 1.7707 2.0659 2.5944 1.7526 4.3904 3.6103 1.2878 1.7750 1.2550 5.4162 1.8675 2.0439 1.1953 1.9330 1.3771 1.0427 1.6448 1.2232 6.4048 6.5772 5.9538 6.3555 1.0362 1.0871 1.0977 1.1005 1.0876 1.0904 1.0965 1.0956 1.0774
irintensity: 0.2388 2.8946 0.8832 1.9597 0.9094 0.4841 0.0532 0.4431 4.8379 7.3191 3.5038 0.1856 4.5265 1.0029 17.0377 33.8455 15.1441 13.3135 0.8924 1.1740 3.2539 78.0615 50.9739 7.4382 31.5992 39.2822 3.9376 6.1573 0.2324 14.2386 7.1701 1.4524 17.6072 7.3697 11.0738 4.8935 86.7212 151.1581 1.9025 11.9879 1.5927 3.5931 10.5181 20.3664 19.0912 23.4962 3.7165 15.9464 9.0545 3.5301 36.9388 146.1227 3.4843 460.3211 14.6128 1.6148 16.5001 10.9381 13.4996 22.8480 19.7835 4.0158 54.5851
temp: 298.150 k
press: 1.00000 atm
elementType: 16 8 7 7 7 6 6 6 6 6 6 6 6 6 1 1 1 1 1 1 1 1 1
symmnumber: 1
zpe: 446586.7 jmol-1
zpe.correction: 0.170096 hartree
zpe.thermalcorrener: 0.182408 hartree
zpe.thermalcorrenthalpy: 0.183352 hartree
zpe.thermalcorrgfe: 0.130733 hartree
zpe.sumelectzpe: -984.864800 hartree
zpe.sumelectthermal: -984.852488 hartree
zpe.sumelectthermalent: -984.851544 hartree
zpe.sumelectthermalfe: -984.904163 hartree
dipole: 0.9307 1.3673 1.5025
dipole: 2.2345
quadrupole: -121.7331 -76.9437 -90.2766
quadrupole: 0.0457 -3.3149 -0.4674
quadrupole: -25.4153 19.3741 6.0412 0.0457 -3.3149 -0.4674
hfenergy: -985.0348958 hartree
pointgroup: C01 [X(C9H9N3O1S1)]
dipole: -0.3592545 0.5734454 -0.5612334 debye
dipolederiv: -0.1622635 0.1876907 0.0743177 0.1434854 -0.3683138 -0.0387457 0.1316672 -0.1470352 -0.1141784 -1.5632063 0.3499803 -0.0130856 0.2812512 -0.5435941 -0.0600536 -0.0916639 -0.0704876 -0.3264946 0.759122 -0.2811567 -0.0532562 -0.1684483 -0.2401737 -0.062688 -0.1184859 -0.0467016 -0.1566892 -1.5019624 0.1773577 -0.0720206 -0.6686931 -0.224434 -0.0679715 -0.5014659 -0.0849971 -0.4527937 -0.4837286 -0.0094842 0.0023673 0.0115187 -0.3169944 -0.0024803 -0.0087787 -0.007903 -0.247624 0.0982356 -0.1184138 0.1494249 -0.2072636 0.0523483 -0.1503337 0.034325 -0.0988618 0.2377397 0.1771521 0.1383734 -0.0744818 0.493831 0.1615586 0.0746624 0.2390759 0.0763908 -0.0462418 0.4580134 -0.0572445 -0.0121603 -0.0866717 0.0683581 -0.0068029 -0.1254618 -0.0018078 0.0201397 -0.0148638 0.024659 -0.0448865 -0.0099688 -0.0254356 0.0380956 0.012771 0.025736 -0.0635749 -0.3524291 0.2008766 0.0200758 0.0906199 -0.0571816 -0.0108107 0.0070236 -0.0092011 -0.1019775 -0.3894579 -0.2114156 -0.0100681 -0.0925069 -0.0756434 -0.0024642 0.0174645 0.0121799 -0.0709288 1.9515747 -0.4686902 0.0308638 0.2841591 0.9029492 0.4208159 0.483372 0.4190529 0.4661953 0.3167002 -0.2327264 -0.0317421 -0.1445908 0.2417251 0.0296174 0.0067843 0.0320402 -0.067159 0.2984502 0.2485077 0.010309 0.0995442 0.2838791 0.0241118 -0.0014203 0.0212592 -0.0732565 0.0253983 0.083907 0.0547988 0.0578904 0.0261422 -0.0262043 0.048224 -0.0017109 0.0025431 0.0573459 -0.1063458 0.0000862 -0.0813289 -0.051739 -0.0038854 -0.0281876 -0.0370686 0.0692223 0.0367828 0.0328534 0.0789664 0.0901199 0.0246406 -0.0896198 0.0272818 -0.0286045 0.0389701 -0.0534311 0.0597378 -0.093055 0.0450717 0.090933 0.0481259 -0.0983719 0.0405631 0.0187242 0.0759985 -0.105502 -0.0039776 -0.1036813 -0.0595963 -0.0084485 -0.015932 -0.011866 0.1336587 0.0978541 0.0863073 0.0031066 0.0512632 0.0227268 -0.0055243 -0.008686 -0.0165875 0.1473573 0.1090852 -0.0040861 -0.0220852 -0.0944735 0.231226 -0.0668416 -0.0153024 -0.0342666 0.3189283 0.0244777 0.0864855 0.0103503 0.092165 -0.0677783 -0.0185812 0.0093753 -0.0178881 0.1328684 0.035152 -0.081671 -0.0038478 -0.0832927 -0.0756027 -0.0139734 -0.0036085 -0.0122348 0.1345713 unknown
polarizability: 221.1965875|-12.8356994|130.7173558|4.7418485|10.1846028|77.5134909 unknown
InChI: InChI=1S/C9H9N3OS/c1-6-8(11-12-9(13)14-6)7-2-4-10-5-3-7/h2-6,12H,1H3
charge 0 multiplicity 1
23 atoms
S  2.587359 0.975629 1.258405
O  4.43532 -0.802216 0.301198
N  0.875228 -1.106277 -0.412813
N  2.267269 -1.15561 -0.462793
N  -4.079353 -0.176929 0.124811
C  1.010241 1.316743 0.22638
C  0.272891 0.011621 -0.027715
C  -1.21168 -0.041234 0.033616
C  1.357601 2.050107 -1.086383
C  -2.006353 1.131061 0.155848
C  -1.899357 -1.285704 -0.041528
C  3.236272 -0.444203 0.268798
C  -3.413816 1.01271 0.195896
C  -3.30644 -1.302333 0.004808
H  0.428429 1.973108 0.892326
H  1.906156 2.982484 -0.869649
H  1.986735 1.424619 -1.742659
H  0.433534 2.304879 -1.638724
H  -1.560527 2.129207 0.210474
H  -1.328689 -2.213187 -0.130969
H  2.614304 -2.014709 -0.899388
H  -4.043096 1.905065 0.288907
H  -3.854828 -2.24923 -0.049046
