program: Gaussian 09
title: 000130001
version: EM64L-G09RevD.01
frameworkgroup: C1[X(C19H27NO2S)]
method: RPBEPBE
basis: SDD
operation: Freq
keyword: #p
keyword: freq=noraman
keyword: PBEPBE/SDD
title: #p freq=noraman PBEPBE/SDD
converged: YES YES NO NO
title: Mulliken charges:
elementType: S O O N C C C C C C C C C C C C C C C C C C C H H H H H H H H H H H H H H H H H H H H H H H H H H H
charge: 0.149888 -0.419942 -0.274674 -0.159578 0.145542 0.077033 0.353034 0.400559 -0.117088 -0.589857 -0.670578 -0.752323 -0.731022 -0.731664 -0.749450 -0.696649 -0.696377 0.597938 -0.270329 -0.333732 0.290273 -0.592489 -0.613214 0.259007 0.259383 0.219687 0.219045 0.218260 0.211674 0.202163 0.260584 0.261050 0.211603 0.201953 0.220465 0.225332 0.224542 0.237291 0.217301 0.202557 0.202587 0.237186 0.217627 0.266952 0.337908 0.267979 0.268389 0.226974 0.280569 0.226629
chargesum: 0.00000
title: Mulliken charges with hydrogens summed into heavy atoms:
elementType: S O O N C C C C C C C C C C C C C C C C C C C
charge: 0.149888 -0.082034 -0.274674 -0.159578 0.145542 0.077033 0.353034 0.400559 -0.117088 -0.330850 -0.411195 -0.095331 -0.056601 -0.057057 -0.079111 -0.039499 -0.038977 0.597938 -0.003377 -0.333732 0.290273 -0.056121 0.120958
polarizability: 4.05999209e+02 1.08972202e+01 2.60962006e+02 -2.47450247e-01 -3.77270579e-01 1.48329327e+02
1716.lowfreq: -11.8990 -0.0014 -0.0005 0.0011 3.6630 7.3694 13.8425 32.8433 47.7968
frequency: 12.1890 32.1529 47.4178 58.8057 66.3423 70.7100 89.3764 124.4235 139.9748 151.6209 152.3176 153.1887 154.0040 180.3835 199.1423 200.9831 201.9825 231.9636 238.2581 260.1169 284.5357 290.0864 305.1118 307.8999 311.0550 334.4262 335.9517 342.6904 346.9719 377.4874 377.8547 395.1566 402.0738 430.9626 432.2396 440.6362 462.6394 470.3804 506.8424 517.3524 573.0742 581.5126 618.9258 635.0852 651.8348 678.7255 705.3572 710.9505 749.4549 771.9943 785.5125 803.2791 879.4245 886.4093 890.0200 891.6137 915.8220 921.6837 922.3379 928.4919 931.4572 947.3332 947.5093 950.0314 975.3677 1019.0029 1022.7324 1025.5485 1026.3794 1030.8776 1102.8366 1108.1851 1117.8084 1144.3511 1169.3686 1196.2420 1200.3301 1203.0356 1206.9784 1211.4309 1227.1822 1241.6814 1254.0512 1259.0638 1294.8453 1302.6612 1326.2357 1369.7606 1373.2650 1374.4489 1380.0647 1384.3384 1389.8211 1400.2339 1413.0085 1417.3821 1427.8945 1439.6230 1457.2834 1457.5473 1467.2867 1469.5115 1474.4572 1475.3275 1476.5993 1478.4715 1478.5418 1488.5805 1491.9439 1493.0907 1496.5885 1502.8103 1507.6788 1582.9204 1595.7015 1606.9705 1631.1000 2965.2473 2971.9369 2974.1905 2976.0949 2976.7528 2980.2745 2981.8483 2990.0553 3044.1695 3049.5530 3058.7998 3061.2102 3063.1001 3064.2858 3071.0647 3074.2526 3074.7374 3077.5665 3083.2817 3083.7582 3084.3991 3098.2092 3111.3562 3114.8242 3159.5746 3176.2419 3596.1015
redmass: 4.5115 4.3182 3.6415 4.8202 2.7433 3.8005 3.0229 3.9922 3.5797 1.7294 1.3833 2.6179 1.4657 1.3124 1.5576 2.8298 1.8882 3.8562 1.2124 1.9727 3.5337 1.6980 2.8841 2.9292 2.8729 1.1131 4.3943 1.5740 1.2830 3.4035 2.4179 2.7212 2.1663 4.2193 4.0371 3.3680 13.5246 4.2967 3.2063 3.1178 4.2676 4.7873 3.9753 3.0865 6.1241 5.0302 8.3970 5.7782 4.9408 6.2996 3.5000 3.0652 3.9074 1.7045 3.0730 1.4376 1.7150 1.7134 1.3000 1.7016 1.6748 1.2211 1.2587 1.4410 3.5161 2.1466 1.4709 1.4301 1.3845 1.3801 2.9118 1.1850 3.3384 1.5360 1.2103 2.5710 2.9229 2.9058 3.1295 1.8763 2.3505 1.7524 2.2496 6.1570 2.2597 1.4819 2.3805 1.1854 1.9822 1.4865 1.3476 3.1145 1.1629 1.2424 1.2322 1.1814 2.6188 2.6554 1.0510 1.0490 1.0655 1.0687 1.0665 1.0514 1.0500 1.0450 1.0589 1.1469 1.0504 1.0530 1.1758 1.0638 1.0639 6.1083 7.2070 6.2559 7.8467 1.0343 1.0355 1.0358 1.0369 1.0354 1.0375 1.0361 1.0532 1.1023 1.1113 1.0982 1.1000 1.0978 1.0993 1.0999 1.0984 1.0991 1.1007 1.0868 1.0991 1.0999 1.0984 1.0977 1.0971 1.0897 1.0898 1.0649
irintensity: 2.2723 0.0564 2.4590 1.0405 1.2737 2.8698 0.2600 0.6286 0.4172 0.0927 2.4338 0.9225 8.0049 0.7051 2.3910 0.3997 2.2065 1.0535 0.0869 0.1303 3.1429 64.9322 10.4247 4.2476 3.3281 1.6889 1.3761 13.5536 18.1004 1.6403 4.0008 1.0313 9.1246 26.6354 15.5541 6.0189 0.1811 0.0025 6.1389 2.3782 8.1194 8.7725 0.4043 9.0713 19.6950 3.7611 12.5311 0.0187 0.7147 13.6978 7.2551 6.5702 0.2138 3.4238 23.3452 0.3924 0.3236 1.3747 1.8584 4.2874 3.6642 0.3397 4.3872 27.7212 11.7571 3.9445 1.6431 4.2241 0.2283 0.6106 66.7459 0.2092 192.5621 122.9383 1.9823 16.4703 8.0156 8.0957 40.1382 174.7917 15.8491 14.6441 40.1116 82.2748 28.8109 5.0246 31.2395 24.6091 257.2465 43.5065 4.3956 30.2685 18.5597 34.4960 40.6975 60.7148 69.0448 127.9068 0.0747 0.1732 3.5549 11.3290 4.6538 2.0905 0.8606 19.9203 1.6711 2.8432 8.9817 10.7666 28.9046 25.3736 18.0103 4.3718 186.8453 45.6259 32.1811 97.5490 18.2268 21.3463 46.0297 42.1145 58.6292 18.2437 92.0926 44.7181 12.5513 3.8858 8.9182 71.8165 12.4801 42.5750 115.3913 21.3105 1.2163 4.4649 88.5404 39.8838 0.7166 2.0781 18.9279 4.9696 7.1928 115.2341
temp: 298.150 k
press: 1.00000 atm
elementType: 16 8 8 7 6 6 6 6 6 6 6 6 6 6 6 6 6 6 6 6 6 6 6 1 1 1 1 1 1 1 1 1 1 1 1 1 1 1 1 1 1 1 1 1 1 1 1 1 1 1
symmnumber: 1
zpe: 1096657.9 jmol-1
zpe.correction: 0.417695 hartree
zpe.thermalcorrener: 0.443353 hartree
zpe.thermalcorrenthalpy: 0.444298 hartree
zpe.thermalcorrgfe: 0.362318 hartree
zpe.sumelectzpe: -1341.731036 hartree
zpe.sumelectthermal: -1341.705378 hartree
zpe.sumelectthermalent: -1341.704434 hartree
zpe.sumelectthermalfe: -1341.786413 hartree
dipole: -0.1988 0.7920 -0.0362
dipole: 0.8174
quadrupole: -112.3211 -149.4146 -150.5275
quadrupole: 23.4334 -0.2151 0.0775
quadrupole: 25.1000 -11.9936 -13.1064 23.4334 -0.2151 0.0775
hfenergy: -1342.1487314 hartree
pointgroup: C01 [X(C19H27N1O2S1)]
dipole: -0.1302138 0.29349 0.0182473 debye
polarizability: 397.946782|33.9327182|267.1264606|9.0747375|14.5780064|150.2172992 unknown
InChI: InChI=1S/C19H27NO2S/c1-18(2,3)13-8-12(9-14(16(13)21)19(4,5)6)10-15-17(22)20(7)11-23-15/h8-10,21H,11H2,1-7H3
charge 0 multiplicity 1
50 atoms
S  2.865038 1.930736 0.3764
O  -3.881226 0.103584 0.056112
O  4.513153 -1.677913 0.024973
N  5.1951 0.556593 0.278317
C  -2.26305 2.458161 0.358865
C  -2.858286 -2.696574 -0.286241
C  -1.661793 1.036646 0.198237
C  -1.950688 -1.44442 -0.108848
C  -2.487362 -0.123552 0.045695
C  -0.266077 0.834742 0.200435
C  -0.546514 -1.56567 -0.094917
C  -1.159447 3.542984 0.49456
C  -3.141994 2.521549 1.646163
C  -3.120908 2.822377 -0.892517
C  -2.022414 -3.997095 -0.445503
C  -3.721026 -2.576496 -1.585984
C  -3.760364 -2.915555 0.973178
C  0.323942 -0.452173 0.059015
C  1.759976 -0.715917 0.061798
C  2.84397 0.113188 0.17893
C  4.229954 -0.447538 0.150362
C  4.77155 1.942492 0.416553
C  6.624502 0.235878 0.28036
H  0.379644 1.706142 0.318389
H  -0.090658 -2.553135 -0.206789
H  -0.508188 3.588394 -0.39804
H  -0.523933 3.381884 1.385133
H  -1.643586 4.530513 0.604964
H  -2.534545 2.298179 2.543018
H  -3.561609 3.539107 1.760529
H  -3.974543 1.802989 1.597453
H  -3.957523 2.119389 -1.02412
H  -2.499761 2.807965 -1.807568
H  -3.534475 3.842156 -0.775121
H  -2.707954 -4.85523 -0.57061
H  -1.367366 -3.960144 -1.334414
H  -1.39751 -4.195897 0.443591
H  -3.062067 -2.488427 -2.468257
H  -4.344243 -3.48165 -1.70792
H  -4.400337 -1.703855 -1.612919
H  -4.440085 -2.075173 1.209535
H  -3.128938 -3.068053 1.866772
H  -4.387214 -3.815768 0.83407
H  2.05601 -1.770964 -0.047976
H  -4.370084 -0.747069 -0.050053
H  5.093385 2.377479 1.380136
H  5.129668 2.568534 -0.42068
H  7.146957 0.729021 -0.56173
H  6.711198 -0.857941 0.170679
H  7.102522 0.546327 1.229289
