program: Gaussian 09
title: 000129955
version: EM64L-G09RevD.01
frameworkgroup: C1[X(C12H15N3O4)]
method: RPBEPBE
basis: SDD
operation: Freq
keyword: #p
keyword: freq=noraman
keyword: PBEPBE/SDD
title: #p freq=noraman PBEPBE/SDD
converged: YES YES NO NO
title: Mulliken charges:
elementType: O O O O N N N C C C C C C C C C C C C H H H H H H H H H H H H H H H
charge: -0.245026 -0.242587 -0.187969 -0.225897 -0.226884 0.110117 -0.002433 -0.228046 -0.414219 0.453521 -0.449241 -0.330044 -0.434389 0.350756 -0.068553 -0.182074 -0.353240 -0.229762 -0.665849 0.254906 0.261978 0.239186 0.242431 0.242379 0.253140 0.263029 0.176245 0.232557 0.244700 0.234407 0.239305 0.215710 0.235990 0.235853
chargesum: 0.00000
title: Mulliken charges with hydrogens summed into heavy atoms:
elementType: O O O O N N N C C C C C C C C C C C C
charge: -0.245026 -0.242587 -0.187969 -0.225897 -0.226884 0.110117 -0.002433 0.026860 0.086945 0.453521 0.035569 -0.076904 -0.171360 0.350756 0.107693 0.050483 -0.108539 0.243950 0.021704
polarizability: 1.53154711e+02 1.25188659e+01 1.70593586e+02 1.29324741e+01 6.87173019e+00 1.60992216e+02
1716.lowfreq: -8.5877 -4.2690 -0.0007 -0.0006 0.0004 3.6551 16.1931 21.9906 29.4872
frequency: 16.1388 21.7254 29.4108 39.5941 57.5270 63.6432 76.0968 78.5775 115.0041 116.9751 165.5613 177.4352 193.7212 205.0396 228.8219 239.7385 247.4096 277.6369 302.0720 354.5231 364.6110 389.1500 420.7827 455.1945 504.3723 541.8127 605.1234 640.9286 666.1673 678.1750 705.0261 719.9973 728.9536 765.4022 801.1627 809.4328 816.2489 841.2798 868.8241 914.1176 925.2208 937.2157 951.2499 989.6547 999.8508 1005.0293 1021.3960 1031.0079 1072.2113 1082.6162 1097.8225 1114.4758 1121.7153 1135.6027 1170.2484 1193.1354 1228.9195 1236.5393 1252.5573 1258.7765 1284.0360 1304.4496 1326.0095 1346.0584 1347.0096 1365.5150 1369.1322 1378.3808 1384.0027 1403.9303 1420.0442 1430.5361 1459.8726 1461.9962 1470.2138 1473.2429 1486.4163 1557.3223 1585.5485 1617.3511 1645.5603 2866.9242 2954.4885 2980.5868 2996.2932 3000.5176 3016.4130 3020.5267 3078.3856 3090.4997 3097.4382 3114.5642 3124.1075 3134.4993 3159.0831 3166.5099
redmass: 5.5317 4.8588 5.0864 4.8397 3.8690 3.2727 5.8706 6.5838 2.6777 4.2456 2.1697 4.0005 4.1951 3.2405 4.5614 6.1984 1.4025 5.6974 4.9908 3.7262 6.7160 3.2141 5.5481 7.8890 4.5394 4.2901 7.6657 5.6017 1.7409 2.4883 8.8975 2.3191 3.8065 4.5642 1.1006 2.8762 2.1073 4.2847 1.7790 2.6901 1.5028 2.7029 1.7257 1.3913 2.1901 3.7285 2.6818 3.0182 4.0987 3.2953 2.6069 2.2486 1.7175 1.4536 1.4292 1.4457 1.9538 2.2018 1.1343 1.7919 1.1907 4.6446 1.6413 1.4389 1.4878 2.5679 1.3333 1.3141 2.0452 1.2812 1.9762 1.1160 1.8977 1.0394 1.1599 1.0648 1.0686 5.4616 5.6565 10.4539 7.4881 1.0845 1.0624 1.0816 1.0957 1.0360 1.0581 1.0627 1.1072 1.1006 1.0985 1.1030 1.0892 1.0909 1.0919 1.0994
irintensity: 2.1494 0.5157 5.9044 2.6745 1.5938 1.1359 0.3989 2.6112 3.4033 3.1654 1.5773 4.5545 5.2588 0.7383 0.2482 9.9388 1.1016 9.8244 12.1776 9.3758 2.3137 0.7259 4.7685 11.7111 15.7114 19.2101 3.4384 1.2843 3.9942 15.7024 24.1778 14.8929 65.0519 13.4390 3.6833 13.5935 6.2131 50.1206 30.5024 46.4047 19.9214 131.4714 33.0874 0.2434 21.5073 7.7961 123.7899 39.9031 38.2143 66.5315 18.6336 6.1902 4.3045 5.5735 19.6725 2.9829 6.9933 287.5357 0.0984 139.8157 10.7506 17.5128 19.6681 56.4140 8.6040 125.2431 1.2236 1.7466 73.8162 15.8116 22.9243 33.8607 33.4060 13.0059 12.0020 3.3910 15.9193 5.1083 2.7734 142.9232 113.2021 150.3166 28.4680 14.8713 7.2274 16.0652 14.7708 10.8293 5.2151 6.7564 22.9316 35.9834 1.7368 18.2019 23.4023 13.4474
temp: 298.150 k
press: 1.00000 atm
elementType: 8 8 8 8 7 7 7 6 6 6 6 6 6 6 6 6 6 6 6 1 1 1 1 1 1 1 1 1 1 1 1 1 1 1
symmnumber: 1
zpe: 681788.4 jmol-1
zpe.correction: 0.259680 hartree
zpe.thermalcorrener: 0.279404 hartree
zpe.thermalcorrenthalpy: 0.280349 hartree
zpe.thermalcorrgfe: 0.207410 hartree
zpe.sumelectzpe: -929.914596 hartree
zpe.sumelectthermal: -929.894872 hartree
zpe.sumelectthermalent: -929.893927 hartree
zpe.sumelectthermalfe: -929.966866 hartree
dipole: 3.5745 -0.7404 2.1432
dipole: 4.2330
quadrupole: -107.6241 -103.9401 -125.5624
quadrupole: 3.6990 -18.8904 -1.0659
quadrupole: 4.7514 8.4355 -13.1869 3.6990 -18.8904 -1.0659
hfenergy: -930.174276 hartree
pointgroup: C01 [X(C12H15N3O4)]
dipole: -0.932513 1.1880483 0.7018155 debye
polarizability: 172.0067058|9.6740097|152.5964515|-15.661083|3.587848|160.137356 unknown
InChI: InChI=1S/C12H15N3O4/c1-2-19-12(17)15(14-18)11(6-4-8-16)10-5-3-7-13-9-10/h3,5,7-9,11H,2,4,6H2,1H3
charge 0 multiplicity 1
34 atoms
O  -2.238861 1.789692 -0.286936
O  -0.879059 0.45371 -1.642505
O  -0.665372 -4.719781 -0.823763
O  -1.070671 -0.011883 2.938086
N  -0.829157 0.217964 0.69429
N  -1.540052 0.546158 1.896022
N  3.31234 0.454934 -1.510302
C  0.358215 -0.710202 0.68903
C  0.042016 -2.045718 -0.023217
C  1.605303 0.028792 0.20178
C  -1.130837 -2.794677 0.635219
C  2.226667 0.975323 1.055984
C  2.190484 -0.189599 -1.071547
C  -1.301605 0.808466 -0.517721
C  -1.368072 -4.182223 0.064444
C  3.381695 1.655896 0.617671
C  3.888527 1.363798 -0.669815
C  -2.797029 2.436017 -1.526166
C  -3.774489 3.501632 -1.048034
H  0.492389 -0.924091 1.769715
H  -0.174905 -1.880521 -1.091248
H  0.947832 -2.678299 0.023537
H  -0.976362 -2.912693 1.730451
H  -2.084149 -2.231492 0.542625
H  1.81149 1.171317 2.052318
H  1.751789 -0.900393 -1.777872
H  -2.243867 -4.72468 0.506775
H  3.883841 2.389724 1.255731
H  4.784723 1.866338 -1.051331
H  -3.281307 1.64991 -2.132642
H  -1.952789 2.853729 -2.102662
H  -4.219084 4.012295 -1.92143
H  -4.588869 3.054278 -0.453833
H  -3.263272 4.25598 -0.426754
