program: Gaussian 09
title: 000129980
version: EM64L-G09RevD.01
frameworkgroup: C1[X(C22H32N2O4)]
method: RPBEPBE
basis: SDD
operation: Freq
keyword: #p
keyword: freq=noraman
keyword: PBEPBE/SDD
title: #p freq=noraman PBEPBE/SDD
converged: YES YES NO NO
title: Mulliken charges:
elementType: O O O O N N C C C C C C C C C C C C C C C C C C C C C C H H H H H H H H H H H H H H H H H H H H H H H H H H H H H H H H
charge: -0.269813 -0.430281 -0.224026 -0.269754 -0.096658 -0.100894 0.225480 -0.400253 -0.392978 -0.401183 -0.730466 -0.717800 0.123105 -0.318935 -0.351023 -0.370339 -0.407860 -0.390644 -0.308410 0.356128 0.354812 -0.187712 -0.393901 -0.322491 -0.208168 -0.322881 -0.392866 -0.323840 0.203734 0.224160 0.208287 0.205836 0.213821 0.216204 0.227118 0.235866 0.206056 0.242367 0.220689 0.214905 0.205082 0.204271 0.193037 0.192498 0.218369 0.220773 0.218695 0.220149 0.217177 0.225666 0.202755 0.202692 0.376915 0.258831 0.247264 0.250205 0.255083 0.246809 0.247795 0.250539
chargesum: 0.00000
title: Mulliken charges with hydrogens summed into heavy atoms:
elementType: O O O O N N C C C C C C C C C C C C C C C C C C C C C C
charge: -0.269813 -0.053366 -0.224026 -0.269754 -0.096658 -0.100894 0.225480 0.027641 0.021144 0.028841 -0.061426 -0.039838 0.123105 0.090419 0.034513 0.068803 0.030984 0.052199 0.097037 0.356128 0.354812 0.071119 -0.146637 -0.072285 0.046915 -0.076073 -0.145070 -0.073301
polarizability: 3.84671947e+02 -1.47363648e+01 2.26412524e+02 -4.64297939e+00 5.67521507e+00 1.96858824e+02
1716.lowfreq: -8.3855 -3.0236 -0.4935 -0.0026 0.0009 0.0031 8.0135 11.0830 14.3453
frequency: 7.4720 10.5553 13.8353 18.5206 21.9191 30.9824 31.9445 40.5877 49.3385 65.9169 70.3094 93.6711 102.6417 107.3368 113.5961 124.9766 132.1706 146.1015 152.5520 163.9302 175.4154 186.6106 200.0705 229.2508 230.5386 251.8640 267.5868 292.9303 330.0280 332.4571 343.3421 358.0179 368.1557 382.5358 416.9059 418.1832 445.7350 481.0869 494.0620 496.1726 514.1520 546.6077 578.6922 600.0567 624.5812 632.8711 652.9116 693.3492 710.0701 717.9264 723.3672 731.3293 739.9406 741.7716 743.6482 772.2373 773.2824 794.7061 804.6545 817.6209 820.9092 840.6355 848.2484 865.6918 880.3623 910.7224 925.7019 937.0229 941.7323 951.4986 958.5477 975.6474 979.6031 996.4876 997.2300 1002.4810 1020.6762 1028.4040 1046.2612 1051.0202 1053.5979 1057.5678 1074.4220 1075.0688 1097.3853 1098.0701 1103.7934 1112.0644 1117.5063 1152.7464 1154.5187 1164.6926 1170.0972 1195.5803 1200.2732 1217.6188 1222.5960 1224.6626 1236.9073 1240.2614 1249.7421 1261.6052 1265.1040 1272.0720 1284.2784 1287.7967 1292.6296 1293.0606 1302.0876 1305.2246 1319.0717 1323.1396 1334.1835 1352.0083 1359.8466 1363.2719 1366.2440 1369.9548 1381.2611 1384.5899 1390.1449 1399.1683 1424.2440 1439.3251 1451.7907 1463.6396 1465.2488 1468.1827 1468.6387 1470.7472 1470.8633 1473.3207 1475.5808 1479.4728 1485.2301 1488.7110 1491.5345 1492.4070 1500.6997 1584.5112 1629.0693 1649.5892 2935.2172 2938.7987 2954.7048 2966.8058 2978.8708 2984.2402 2984.6884 2990.3347 2992.7398 2993.0410 2994.7135 2995.6240 2998.5914 2999.7636 3014.5069 3036.9970 3046.5688 3060.2281 3063.9000 3069.2715 3078.0108 3088.6566 3098.7892 3101.6281 3150.1940 3151.5299 3169.4227 3173.3072 3220.6437 3227.4820 3249.0677 3514.8833
redmass: 6.0892 4.3509 5.9680 4.6118 3.6935 9.0601 4.7589 5.0844 4.6238 4.8079 3.1771 2.1733 2.2420 2.5651 3.8962 3.0843 2.8916 2.0065 2.1406 4.1631 6.2497 2.5160 1.2615 1.6033 2.4798 2.9149 2.5580 3.8829 2.5516 3.4442 2.9015 7.2774 3.6355 3.5962 3.0619 3.7271 3.5276 4.1403 3.5096 3.8414 2.3387 3.6957 4.7218 1.2681 3.1335 6.7534 3.4058 3.5673 3.6600 4.0311 1.3263 3.6061 1.0893 1.2375 4.9111 1.1548 1.4046 1.2412 1.2657 6.5015 1.6498 1.4137 1.2318 2.1999 6.0113 1.5158 1.3727 1.6125 1.3466 1.6253 1.2358 6.7070 6.6579 2.0974 1.6103 4.3806 3.7463 2.9478 2.8193 1.9186 2.9829 2.6398 2.4636 1.5331 2.6066 2.1432 2.7132 1.5718 1.2925 1.3182 1.3117 2.6220 1.2010 2.9389 2.2352 1.5721 1.9177 1.5860 4.7014 1.3136 1.3808 1.7652 1.4534 1.3735 1.2478 1.0979 1.1290 1.2624 1.2991 1.2945 1.6064 1.3175 5.2234 1.4603 1.5013 1.7506 2.6860 1.9530 1.2117 1.4812 1.8707 1.2121 3.8543 2.2386 1.0675 1.0679 1.6086 1.0747 1.0726 1.2426 1.1035 1.0825 1.1375 1.3009 1.3327 1.1671 1.0675 1.1797 1.7197 7.2298 6.7053 8.5902 1.0549 1.0550 1.0588 1.0603 1.0603 1.0356 1.0598 1.1061 1.0374 1.0646 1.0995 1.0598 1.0656 1.0936 1.0980 1.1023 1.1026 1.1054 1.1046 1.1053 1.1001 1.0996 1.0999 1.0993 1.0870 1.0876 1.0960 1.0965 1.0909 1.0970 1.1098 1.0641
irintensity: 0.1318 1.1074 0.2612 0.8930 0.7162 0.9556 3.2170 0.5678 0.3060 0.6005 0.1396 1.1591 0.3053 0.1276 0.7595 0.2279 0.1220 4.5902 0.0456 0.3457 4.9205 0.8702 0.4127 0.0610 0.0586 0.5034 1.0354 1.2466 0.4346 0.3441 6.0822 0.0006 0.6683 1.4703 0.0987 4.5877 11.8851 1.3643 16.5496 2.4707 19.0133 11.9811 7.2789 125.9458 9.7572 0.1095 17.3762 11.0090 0.0040 18.3294 26.3480 18.2958 10.5594 12.3168 69.2666 8.5521 64.5440 0.7273 3.6371 1.0556 83.8042 2.5937 1.2264 4.9117 10.3980 5.7244 0.3905 9.9293 2.8650 7.7165 0.0358 1.9792 130.9811 23.7462 51.7453 36.9409 9.1498 175.4127 42.3362 11.1210 31.7631 31.7115 0.7224 12.7033 0.7302 3.3888 1.6853 12.1671 20.3268 2.1829 0.3632 1.3886 0.0010 678.9945 8.6394 24.3088 1.7662 1.1028 0.9478 7.1100 6.4191 34.1463 5.2509 5.1895 4.9618 1.2682 0.1859 2.4117 0.0082 0.5120 6.7365 3.2699 0.9476 11.2814 0.9442 0.9607 5.2494 14.6242 15.3967 1.3173 76.6139 25.9714 3.6263 44.9948 1.0216 6.8157 2.3947 5.8709 0.6931 7.0882 6.1771 4.7896 88.1540 57.6996 82.1488 20.7855 22.7096 40.5714 166.4651 0.0162 0.0587 212.1301 42.0231 30.9938 28.9270 7.8758 24.1128 29.0092 2.8477 30.4223 22.6969 35.3235 34.0120 4.8893 74.9146 21.2392 2.8157 1.0941 3.0283 9.5870 84.7700 92.4949 17.1046 43.0070 20.3816 34.4746 24.5301 4.7610 18.8366 0.1828 2.5461 2.7904 3.8588 21.5923
temp: 298.150 k
press: 1.00000 atm
elementType: 8 8 8 8 7 7 6 6 6 6 6 6 6 6 6 6 6 6 6 6 6 6 6 6 6 6 6 6 1 1 1 1 1 1 1 1 1 1 1 1 1 1 1 1 1 1 1 1 1 1 1 1 1 1 1 1 1 1 1 1
symmnumber: 1
zpe: 1323751.1 jmol-1
zpe.correction: 0.504190 hartree
zpe.thermalcorrener: 0.534711 hartree
zpe.thermalcorrenthalpy: 0.535656 hartree
zpe.thermalcorrgfe: 0.434180 hartree
zpe.sumelectzpe: -1265.769690 hartree
zpe.sumelectthermal: -1265.739169 hartree
zpe.sumelectthermalent: -1265.738225 hartree
zpe.sumelectthermalfe: -1265.839700 hartree
dipole: 4.4092 -2.6159 -2.4953
dipole: 5.7018
quadrupole: -239.0329 -170.0683 -166.3604
quadrupole: 1.3495 20.9244 -7.2257
quadrupole: -47.2123 21.7522 25.4601 1.3495 20.9244 -7.2257
hfenergy: -1266.2738801 hartree
pointgroup: C01 [X(C22H32N2O4)]
dipole: -1.7398592 0.7158685 -1.221714 debye
polarizability: 384.7751966|-12.5793878|221.1233553|8.0031214|-12.5744914|202.044743 unknown
InChI: InChI=1S/C22H32N2O4/c1-22(2,21(25)26)12-4-7-17-28-20-10-8-19(9-11-20)27-16-6-3-5-14-24-15-13-23-18-24/h8-11,13,15,18,25H,3-7,12,14,16-17H2,1-2H3
charge 0 multiplicity 1
60 atoms
O  -3.039615 1.035181 -0.549812
O  -9.217044 -1.462093 -1.546287
O  -9.360049 -2.384147 0.571045
O  2.357345 -0.343247 0.377714
N  9.818266 0.014775 -0.242141
N  11.749866 -0.212501 0.933901
C  -9.291822 0.101875 0.320774
C  -7.990296 0.801557 -0.197526
C  -6.660332 0.169116 0.269428
C  -5.440598 0.886869 -0.35263
C  -9.38561 0.139207 1.864603
C  -10.52562 0.821084 -0.302924
C  -9.295997 -1.359766 -0.144164
C  -4.11539 0.279168 0.112656
C  5.972102 0.480704 -0.496148
C  7.312277 -0.118582 -0.016134
C  4.755049 -0.2055 0.164515
C  8.525547 0.563431 -0.688741
C  3.428517 0.401224 -0.300025
C  -1.711649 0.650176 -0.283489
C  1.027232 0.041243 0.110963
C  10.386282 -1.206461 -0.63243
C  -0.712023 1.398471 -0.946575
C  -1.336313 -0.409729 0.582417
C  10.676483 0.571519 0.70595
C  0.652617 1.100847 -0.755005
C  0.028351 -0.707112 0.774283
C  11.572307 -1.327095 0.097144
H  -8.031531 1.858343 0.136588
H  -8.016537 0.80915 -1.30376
H  -6.638087 -0.90397 -0.011811
H  -6.587369 0.207728 1.374291
H  -5.453974 1.961195 -0.085095
H  -5.49073 0.83003 -1.456887
H  -10.340153 -0.293537 2.210916
H  -8.575601 -0.437837 2.340387
H  -9.328413 1.18645 2.213631
H  -10.483916 0.798875 -1.404793
H  -11.470025 0.347609 0.021405
H  -10.540707 1.875189 0.029879
H  -4.050333 -0.793128 -0.170383
H  -4.006494 0.359859 1.21534
H  5.952838 1.568185 -0.273049
H  5.898437 0.385043 -1.60002
H  7.335334 -1.204209 -0.233861
H  7.400813 -0.013669 1.082625
H  4.754531 -1.28672 -0.071787
H  4.820979 -0.117922 1.265776
H  8.522613 1.645617 -0.460538
H  8.454488 0.461166 -1.788322
H  3.3129 0.308012 -1.4014
H  3.369808 1.477612 -0.030231
H  -9.232648 -2.42479 -1.799169
H  9.919557 -1.851429 -1.372838
H  -1.020225 2.212012 -1.610463
H  -2.087831 -1.005511 1.108182
H  10.480568 1.529679 1.182769
H  1.403948 1.696629 -1.281267
H  0.336159 -1.520686 1.4383
H  12.302516 -2.132589 0.070826
