program: Gaussian 09
title: 000129935
version: EM64L-G09RevD.01
frameworkgroup: C1[X(C9H12N2O4S)]
method: RPBEPBE
basis: SDD
operation: Freq
keyword: #p
keyword: freq=noraman
keyword: PBEPBE/SDD
title: #p freq=noraman PBEPBE/SDD
converged: YES YES NO NO
title: Mulliken charges:
elementType: S O O O O N N C C C C C C C C C H H H H H H H H H H H H
charge: 0.240289 -0.437611 -0.160087 -0.404708 -0.276509 -0.155147 -0.535362 -0.155251 -0.506746 0.091703 -0.076027 0.340254 -0.225535 -0.693820 -0.467866 0.125198 0.300842 0.288392 0.203752 0.233498 0.248598 0.224872 0.232268 0.250232 0.338485 0.322306 0.266760 0.387220
chargesum: 0.00000
title: Mulliken charges with hydrogens summed into heavy atoms:
elementType: S O O O O N N C C C C C C C C C
charge: 0.240289 -0.099126 -0.160087 -0.017488 -0.276509 -0.155147 0.053704 0.145591 -0.218353 0.091703 0.127725 0.340254 -0.225535 0.013148 0.014633 0.125198
polarizability: 1.87186311e+02 2.58889401e+00 1.60174484e+02 -3.28334904e+00 -1.72841350e-01 9.70622450e+01
1716.lowfreq: -2.7607 -0.0010 -0.0006 0.0016 6.1650 9.9847 42.4221 55.3043 61.5220
frequency: 42.4206 55.2969 61.5209 76.2780 93.7637 103.2795 126.9046 145.5389 173.1874 192.2257 214.6199 242.9040 253.3101 282.2767 305.4919 343.1177 355.4042 370.8197 401.7927 416.6425 429.7558 474.9297 491.6451 540.3307 569.3197 597.2451 611.5104 657.9662 694.5789 706.1940 728.9070 749.7928 770.5490 864.1949 883.9842 903.3919 929.3044 986.9671 1008.1340 1037.3939 1053.1362 1057.1148 1071.0778 1088.8355 1128.9755 1138.3722 1160.3401 1176.4117 1197.3386 1216.4911 1228.6631 1258.9739 1268.4655 1329.6866 1336.1101 1341.2908 1356.5692 1368.8467 1397.3724 1435.3660 1462.3283 1476.1660 1546.7716 1598.0497 1639.2232 1732.7528 2950.9776 2998.4060 3007.9890 3053.9196 3063.3697 3067.4134 3098.6510 3108.4964 3447.5184 3526.3214 3550.1991 3585.5549
redmass: 6.4023 4.7935 4.0110 5.6306 5.0289 3.7833 6.2673 7.6838 4.0369 1.2023 4.0081 4.3176 3.4236 1.1522 5.9033 5.2624 5.7009 3.6075 1.4088 6.0645 3.9564 3.6860 3.9413 3.0767 3.5230 1.7777 3.4897 2.8372 2.5029 5.3251 8.2220 3.7597 6.8660 2.5571 1.9784 2.4091 3.4231 6.2184 2.8836 3.2851 1.7854 3.4327 2.1403 4.2749 2.0053 1.7905 1.5822 1.4585 1.3660 1.4373 1.4074 1.7006 2.2677 1.2039 1.3144 1.2712 1.5842 3.9044 1.2652 1.0916 1.0453 1.0484 7.8629 5.0068 1.1759 12.7192 1.0852 1.0357 1.0598 1.0902 1.0851 1.1032 1.0998 1.1008 1.0452 1.0643 1.0664 1.0985
irintensity: 0.1264 0.7160 1.2301 0.2824 0.2768 2.6419 3.8093 0.9664 0.1075 3.7274 3.0488 15.2800 4.0190 170.3173 8.3182 5.8722 6.9606 21.1810 58.8516 7.4146 3.9760 7.0513 8.7553 7.3769 71.0311 124.7985 50.3920 140.2549 203.9582 48.1925 32.3380 32.7368 3.0588 21.2733 22.3786 10.7276 37.9784 76.5278 79.0875 96.1537 39.6578 103.5260 20.1845 14.0687 63.7312 133.4334 13.0901 28.2476 22.2423 11.2810 32.4293 4.8223 98.6762 1.8208 26.3319 7.7258 30.1224 136.0555 27.9061 20.7314 13.6647 4.5136 160.3482 236.9237 36.5982 408.3527 37.9794 14.3373 22.9722 27.5262 2.8708 7.2602 20.3661 20.2217 11.6346 64.8991 9.2437 10.0373
temp: 298.150 k
press: 1.00000 atm
elementType: 16 8 8 8 8 7 7 6 6 6 6 6 6 6 6 6 1 1 1 1 1 1 1 1 1 1 1 1
symmnumber: 1
zpe: 546791.7 jmol-1
zpe.correction: 0.208262 hartree
zpe.thermalcorrener: 0.225148 hartree
zpe.thermalcorrenthalpy: 0.226092 hartree
zpe.thermalcorrgfe: 0.163318 hartree
zpe.sumelectzpe: -1157.361506 hartree
zpe.sumelectthermal: -1157.344621 hartree
zpe.sumelectthermalent: -1157.343676 hartree
zpe.sumelectthermalfe: -1157.406451 hartree
dipole: 0.9247 -1.2839 -2.0986
dipole: 2.6282
quadrupole: -117.2360 -100.9030 -97.2784
quadrupole: -2.4576 -2.8361 -1.8770
quadrupole: -12.0969 4.2362 7.8608 -2.4576 -2.8361 -1.8770
hfenergy: -1157.5697682 hartree
pointgroup: C01 [X(C9H12N2O4S1)]
dipole: -0.372447 -0.4510224 0.8526718 debye
polarizability: 187.0011892|-3.4678081|160.1751185|-3.5501276|-3.0811148|97.2467323 unknown
InChI: InChI=1S/C9H12N2O4S/c1-3(12)5-7(13)11-6(9(14)15)4(2-10)16-8(5)11/h3,5,8,12,14H,2,10H2,1H3
charge 0 multiplicity 1
28 atoms
S  0.206934 -2.334853 0.154827
O  -4.174065 -1.249061 0.585189
O  -1.05537 1.811466 -1.390392
O  1.59444 2.464079 0.695023
O  3.467427 1.197499 0.134757
N  -0.136651 0.338083 0.344531
N  3.717951 -1.41653 -1.247183
C  -2.05835 -0.353823 -0.332644
C  -0.950302 -0.863516 0.645797
C  -1.073385 0.829939 -0.63608
C  -3.437931 -0.007339 0.265296
C  1.282949 0.14391 0.303948
C  1.645108 -1.190775 0.174529
C  -4.309163 0.758917 -0.732864
C  3.044843 -1.782033 0.006468
C  2.225682 1.262747 0.361791
H  -2.192069 -1.002755 -1.214757
H  -1.217039 -1.002963 1.705664
H  -3.290721 0.598252 1.187056
H  -5.271825 1.025736 -0.266187
H  -3.800744 1.678399 -1.070213
H  -4.516937 0.127332 -1.614536
H  2.987559 -2.882281 0.089743
H  3.672851 -1.426344 0.843233
H  -3.746093 -1.706797 1.353654
H  4.014478 -0.433945 -1.259608
H  3.23053 -1.709185 -2.099099
H  2.267692 3.19654 0.671655
