program: Gaussian 09
title: 000129948
version: EM64L-G09RevD.01
frameworkgroup: C1[X(C18H21NO2)]
method: RPBEPBE
basis: SDD
operation: Freq
keyword: #p
keyword: freq=noraman
keyword: PBEPBE/SDD
title: #p freq=noraman PBEPBE/SDD
converged: YES YES NO NO
title: Mulliken charges:
elementType: O O N C C C C C C C C C C C C C C C C C C H H H H H H H H H H H H H H H H H H H H H
charge: -0.430382 -0.439552 -0.313959 -0.023148 -0.478093 -0.574485 -0.562435 0.339457 0.291263 -0.344620 -0.582023 -0.380008 -0.255638 0.290333 -0.379900 0.417314 -0.441671 -0.389680 -0.219626 -0.224603 -0.240244 0.193428 0.233363 0.187125 0.221324 0.245703 0.223148 0.215987 0.242969 0.191841 0.228714 0.224105 0.177311 0.231753 0.249042 0.339514 0.232256 0.269166 0.350449 0.227155 0.227223 0.230122
chargesum: 0.00000
title: Mulliken charges with hydrogens summed into heavy atoms:
elementType: O O N C C C C C C C C C C C C C C C C C C
charge: -0.090868 -0.089103 -0.070990 0.170280 -0.057604 -0.107458 -0.123299 0.339457 0.291263 0.075935 -0.357918 -0.148254 -0.078326 0.290333 -0.130858 0.417314 -0.209415 -0.120515 0.007528 0.002620 -0.010123
polarizability: 2.55070226e+02 8.15039788e+00 2.09895437e+02 -7.38612811e+00 1.89932198e+01 1.46155738e+02
1716.lowfreq: -0.0008 -0.0007 -0.0004 0.9171 4.8549 7.5971 17.7102 29.6598 33.9233
frequency: 14.1381 29.4648 33.8996 45.8858 65.5247 100.2678 111.7138 140.5169 178.4377 203.3080 205.6207 223.3413 238.4551 277.7687 320.4165 326.3124 344.8637 354.8100 365.6242 398.6522 405.9828 428.5294 436.6616 440.6018 467.4308 509.9630 531.1742 535.4570 570.1597 588.7708 616.1289 625.7675 655.6220 697.8775 707.3861 723.0214 747.3087 769.3295 805.2052 821.3118 835.5678 846.4233 857.1240 873.7810 908.4834 917.8981 923.3941 937.2651 954.2424 979.4959 989.2404 997.3256 1004.8057 1023.4953 1026.6099 1038.4635 1059.8618 1072.7492 1086.7461 1107.8313 1128.1845 1132.0066 1136.1942 1158.5175 1172.5621 1172.8217 1183.8418 1192.1995 1203.4700 1207.1274 1218.3177 1236.3406 1255.4381 1260.3730 1271.8932 1287.2125 1304.5586 1314.0261 1325.8454 1336.0920 1338.1340 1345.0175 1370.8202 1386.7084 1389.7790 1391.0773 1429.8867 1441.1420 1454.5423 1460.3838 1465.9820 1471.1368 1474.8455 1481.5296 1505.8604 1594.6354 1606.0097 1612.9498 1619.8015 2815.6645 2849.9202 2908.6543 2954.4705 2969.0219 2976.0147 3016.3095 3017.3879 3026.8870 3042.5307 3092.4563 3112.8350 3117.3457 3125.6078 3137.9187 3149.3315 3163.9640 3170.3315 3436.0091 3546.8163 3581.6668
redmass: 4.7118 4.2347 4.9404 4.4500 4.0893 3.0757 3.8640 2.9154 5.0864 3.1402 4.0636 3.3332 3.1542 3.4829 1.7195 2.8106 1.1792 2.0464 2.7965 4.6586 2.8136 2.7553 2.9824 3.8599 2.4619 2.4729 2.8295 3.3686 2.9408 2.8235 6.4173 4.4753 4.0926 2.8923 1.7582 3.7508 4.8280 1.8520 2.0689 1.8853 1.6223 1.9018 1.2685 2.6940 1.9214 1.7631 1.4304 3.4605 1.3655 1.3821 6.2674 1.3318 2.9996 2.3625 2.4876 2.3278 2.4684 2.0998 1.6384 1.7045 1.4383 1.8087 1.4406 3.1596 1.0588 1.3988 1.1170 1.2589 2.1310 1.9060 1.3928 1.3680 1.4583 1.2969 1.8086 1.3949 1.2877 1.7512 1.2910 1.3502 1.3714 1.4685 1.7128 3.7610 2.9082 2.5040 3.3996 2.1400 1.1370 1.0900 1.2513 1.1160 1.1239 2.1841 2.6415 6.0934 6.6892 6.1149 6.6815 1.0804 1.0714 1.0830 1.0647 1.0602 1.0624 1.0889 1.0943 1.0977 1.1009 1.0908 1.0876 1.0896 1.0859 1.0912 1.0957 1.1014 1.0950 1.0742 1.0658 1.0659
irintensity: 0.0864 0.0888 0.0772 0.5414 0.4879 2.3779 0.9542 0.8253 0.7644 3.0570 1.3505 4.3048 1.9565 1.6871 72.8914 0.3035 140.5195 70.6585 29.5305 2.6903 1.4781 6.3738 25.0794 2.6069 23.0130 36.0234 29.6651 20.7853 13.9020 7.6702 0.6131 2.1050 10.1838 4.4855 52.7311 7.5793 14.9441 45.8789 14.9076 11.1636 43.2548 1.8341 0.5259 19.5444 7.8198 10.4118 7.3356 9.1254 1.5163 0.1893 0.3156 1.8208 0.8475 13.0658 65.9415 14.5257 1.4644 2.6827 6.7862 3.5006 20.4998 218.4535 19.5950 55.7634 0.2694 22.2065 1.4548 17.1267 9.0232 11.5487 5.1106 3.3078 0.3190 10.9741 15.8457 23.6995 1.7455 0.4316 2.7509 5.8659 9.8154 37.8178 25.8651 6.4013 11.5859 7.7389 29.3602 12.4248 3.1653 11.4825 17.3953 1.9071 26.4147 8.1708 60.5011 0.6783 20.8221 2.8636 64.7618 78.8311 109.8003 50.8543 29.9535 22.5394 56.0966 14.2086 41.5455 24.6915 52.3876 20.4899 9.5979 16.2968 0.1432 16.6864 29.7140 23.1372 10.1744 2.1425 6.8131 30.8841
temp: 298.150 k
press: 1.00000 atm
elementType: 8 8 7 6 6 6 6 6 6 6 6 6 6 6 6 6 6 6 6 6 6 1 1 1 1 1 1 1 1 1 1 1 1 1 1 1 1 1 1 1 1 1
symmnumber: 1
zpe: 915453.8 jmol-1
zpe.correction: 0.348678 hartree
zpe.thermalcorrener: 0.367983 hartree
zpe.thermalcorrenthalpy: 0.368928 hartree
zpe.thermalcorrgfe: 0.298840 hartree
zpe.sumelectzpe: -902.157990 hartree
zpe.sumelectthermal: -902.138684 hartree
zpe.sumelectthermalent: -902.137740 hartree
zpe.sumelectthermalfe: -902.207827 hartree
dipole: 3.7373 -0.4545 -1.3366
dipole: 3.9950
quadrupole: -126.7071 -110.0931 -127.7937
quadrupole: 5.2484 -3.2260 8.5211
quadrupole: -5.1758 11.4382 -6.2624 5.2484 -3.2260 8.5211
hfenergy: -902.5066675 hartree
pointgroup: C01 [X(C18H21N1O2)]
dipole: -1.464119 -0.1734519 0.5447159 debye
polarizability: 255.3743218|-7.6780142|206.4371525|-6.7653388|-23.5226178|149.3099271 unknown
InChI: InChI=1S/C18H21NO2/c20-17-9-7-13-6-8-16(10-15(13)11-17)19-12-18(21)14-4-2-1-3-5-14/h1-5,7,9,11,16,18-21H,6,8,10,12H2
charge 0 multiplicity 1
42 atoms
O  -2.909169 -1.260526 -2.001369
O  5.499781 2.995193 -0.456309
N  -0.461376 -1.546316 -0.357723
C  0.857222 -1.208852 0.217899
C  1.811647 -2.411476 0.066232
C  1.468245 0.013675 -0.505661
C  3.153146 -2.135199 0.77557
C  2.936501 0.248879 -0.161076
C  3.74137 -0.77325 0.413677
C  -1.542265 -0.574756 -0.119849
C  3.516444 1.510152 -0.450229
C  5.109127 -0.499753 0.674002
C  -2.9209 -1.125501 -0.533462
C  4.880042 1.758505 -0.18328
C  5.689872 0.748669 0.383821
C  -4.050876 -0.212116 -0.061575
C  -4.789162 -0.519672 1.107398
C  -4.362444 0.968104 -0.784368
C  -5.816493 0.341027 1.556432
C  -5.389539 1.828518 -0.337767
C  -6.118665 1.518938 0.834743
H  0.782677 -0.964414 1.31225
H  1.970888 -2.597807 -1.013447
H  1.345255 -3.322722 0.493403
H  0.8876 0.928641 -0.279135
H  1.35619 -0.168549 -1.594271
H  3.88051 -2.933293 0.531831
H  2.998733 -2.184219 1.874319
H  -0.746499 -2.50531 -0.116306
H  -1.614434 -0.266252 0.954993
H  -1.358701 0.344875 -0.707652
H  2.889885 2.298963 -0.89138
H  -3.056447 -2.128828 -0.063834
H  5.734738 -1.286592 1.114111
H  6.745129 0.956392 0.582836
H  -3.819645 -1.521806 -2.29559
H  -4.563446 -1.436888 1.666758
H  -3.800691 1.19723 -1.69699
H  4.852358 3.627308 -0.856326
H  -6.382636 0.091898 2.461036
H  -5.623487 2.73826 -0.902487
H  -6.916985 2.185772 1.179375
