program: Gaussian 09
title: 000129917
version: EM64L-G09RevD.01
frameworkgroup: C1[X(C7H13NO2)]
method: RPBEPBE
basis: SDD
operation: Freq
keyword: #p
keyword: freq=noraman
keyword: PBEPBE/SDD
title: #p freq=noraman PBEPBE/SDD
converged: YES YES NO NO
title: Mulliken charges:
elementType: O O N C C C C C C C H H H H H H H H H H H H H
charge: -0.447139 -0.441001 -0.257640 -0.276066 -0.153692 -0.061968 -0.462229 -0.133144 -0.446650 -0.442909 0.239306 0.233522 0.221914 0.260827 0.201919 0.201082 0.206413 0.209028 0.233508 0.232987 0.223956 0.324676 0.333297
chargesum: 0.00000
title: Mulliken charges with hydrogens summed into heavy atoms:
elementType: O O N C C C C C C C
charge: -0.122463 -0.107704 -0.024132 -0.036760 0.079831 0.159946 0.000517 0.067939 -0.031209 0.014035
polarizability: 8.31677140e+01 1.97987278e+00 9.13309589e+01 -4.93239467e-01 2.73789692e+00 7.40190925e+01
1716.lowfreq: -24.1016 -0.0007 0.0004 0.0007 8.1179 22.9352 120.9960 150.6340 222.4941
frequency: 120.9755 150.6192 222.4502 276.8821 283.9077 307.0855 325.9974 367.5371 407.1277 408.1401 470.9348 520.5645 576.5347 665.6796 721.9796 800.5598 802.8871 823.1673 862.5707 896.6044 926.2502 944.5220 969.4337 987.1037 1003.0778 1021.9112 1039.4127 1075.3493 1088.8638 1100.1492 1142.5002 1161.4182 1179.3576 1191.9272 1218.0568 1232.4987 1251.7315 1269.5023 1292.0731 1294.4479 1299.9668 1322.7267 1338.8999 1347.0638 1383.7984 1391.7263 1405.2564 1456.3807 1465.4280 1483.8168 2924.4827 2967.4527 2992.7804 2994.3717 3000.1302 3026.1966 3026.6127 3040.6295 3059.6826 3099.3140 3401.9431 3556.6938 3558.9204
redmass: 2.9969 4.7272 2.3307 1.2825 2.3666 1.2320 2.7163 3.4657 3.0280 2.9691 2.9902 2.5330 3.1614 2.3386 3.9593 2.6875 2.3369 2.5585 2.5234 2.2082 2.4225 2.3467 2.3486 2.0887 2.4939 3.1315 2.3790 1.7602 1.8305 1.7916 1.2065 1.1390 1.4420 1.3789 1.2844 1.3010 1.9265 1.2586 1.2776 1.4092 1.2526 1.4508 1.3817 1.3973 1.5815 1.3787 1.4166 1.0958 1.0872 1.0853 1.0841 1.0612 1.0864 1.0834 1.0665 1.0843 1.0827 1.0802 1.1025 1.1043 1.0746 1.0660 1.0659
irintensity: 3.4883 3.3101 8.5668 130.0193 19.8635 120.3646 11.8449 12.7403 14.3068 5.6471 11.1666 52.7244 6.0089 79.0230 9.9861 24.6595 37.5958 5.4771 5.3567 14.2476 21.1231 10.7099 44.4903 0.4228 55.7357 59.7330 3.0237 2.2861 13.7842 9.2536 14.1966 27.8967 21.3449 16.3698 17.2059 21.8349 6.0323 2.3294 0.4595 11.4703 5.3228 8.5103 3.7586 6.2420 1.3181 4.5888 17.8293 10.7951 5.5680 13.5774 60.9571 45.2134 62.0171 19.4271 30.0503 11.2580 48.4582 59.1317 48.2738 17.9193 4.6270 3.6752 3.7041
temp: 298.150 k
press: 1.00000 atm
elementType: 8 8 7 6 6 6 6 6 6 6 1 1 1 1 1 1 1 1 1 1 1 1 1
symmnumber: 1
zpe: 520053.0 jmol-1
zpe.correction: 0.198078 hartree
zpe.thermalcorrener: 0.207207 hartree
zpe.thermalcorrenthalpy: 0.208151 hartree
zpe.thermalcorrgfe: 0.164771 hartree
zpe.sumelectzpe: -478.907198 hartree
zpe.sumelectthermal: -478.898069 hartree
zpe.sumelectthermalent: -478.897125 hartree
zpe.sumelectthermalfe: -478.940505 hartree
dipole: -2.2446 0.5237 1.0269
dipole: 2.5233
quadrupole: -69.7931 -52.4303 -60.3209
quadrupole: 4.4355 -5.1151 5.1760
quadrupole: -8.9450 8.4178 0.5272 4.4355 -5.1151 5.1760
hfenergy: -479.1052756 hartree
pointgroup: C01 [X(C7H13N1O2)]
dipole: -0.8828499 0.1498001 0.4285935 debye
dipolederiv: -0.7663174 -0.3476225 0.0514311 -0.3343576 -0.2936438 0.0600347 0.0111354 0.0264134 -0.5409151 -0.6868467 0.2435353 0.0322637 0.2268626 -0.7878389 0.2104134 -0.01535 0.2781874 -0.2359105 -0.5075711 0.0983076 -0.270395 0.0459461 -0.4447685 -0.050788 -0.2520344 -0.009402 -0.4670223 0.0378419 0.0460462 0.0829107 -0.0041177 0.2935864 -0.003838 0.1504088 0.005371 0.0456654 0.352852 -0.0420954 0.028641 0.0027168 0.3060946 0.0958526 0.0609187 0.1369194 0.2802818 0.6043402 0.2747351 0.0186035 0.265261 0.3824505 -0.0527961 -0.0134021 0.0145679 0.3131835 -0.007548 -0.0109036 0.0646379 -0.063012 -0.1069097 0.0293054 0.0335313 0.0050556 0.0830659 0.4035038 -0.156728 -0.0601422 -0.1667003 0.6145414 -0.0846029 -0.0169205 -0.1011721 0.2800078 -0.0566333 0.0004223 -0.0853691 0.0185059 0.0746317 -0.0154897 -0.0472416 -0.0365101 0.0812749 0.0761646 0.0068719 -0.0578927 0.0299116 -0.0598457 -0.0313438 -0.0139243 -0.059819 0.0466099 0.0228161 -0.0289527 -0.0273468 -0.0375279 -0.1460295 -0.1131717 -0.0184031 -0.130688 -0.0261105 0.0015602 0.0829995 -0.0272527 0.0700973 -0.1721912 0.0304343 -0.0233769 0.0552679 0.0386296 -0.0392021 -0.0035872 -0.0938791 0.0126371 -0.0259979 0.0707202 -0.0770316 0.0672049 -0.068415 -0.0900046 0.0360883 0.0104996 0.0264754 0.0675672 -0.0019079 -0.0322511 0.0204048 0.0882585 0.0776728 -0.0389374 -0.0731167 -0.0070106 0.0358932 -0.0396076 -0.017521 -0.0665138 -0.138749 -0.081229 -0.0013183 0.0972539 -0.0077227 -0.0273933 0.0445131 0.110867 0.0549021 -0.1857555 -0.0403233 -0.062216 0.0799943 -0.0315144 0.0057071 0.0685678 0.1088592 0.1306401 -0.0771955 0.0571409 -0.0063331 -0.0272443 -0.0175253 -0.0725799 -0.1180878 -0.0552291 -0.1699533 -0.0909877 0.117341 -0.083004 0.2975464 -0.0345203 0.0873394 0.0072681 0.148755 -0.0116845 0.1473893 0.0731898 -0.0290142 0.097371 -0.013795 0.0242625 0.0545381 0.0633383 0.0457125 -0.0838656 -0.1915776 -0.0107675 -0.0580651 -0.0071291 0.0616649 -0.0045815 -0.0235078 -0.0084818 0.0718201 0.276458 0.1331135 -0.0005777 0.0677517 0.0103045 -0.0498584 -0.0313484 -0.084315 0.347345 0.3663717 -0.1006397 -0.0798717 -0.0412324 0.173155 -0.1055743 -0.0502719 -0.1621072 0.091395 unknown
polarizability: 82.8942911|1.4898084|91.59549|-0.9415159|2.5303731|74.0279843 unknown
InChI: InChI=1S/C7H13NO2/c9-5-2-1-4-3-6(10)7(5)8-4/h4-10H,1-3H2
charge 0 multiplicity 1
23 atoms
O  2.411105 1.222913 -0.293921
O  -1.69063 2.004134 -0.252663
N  0.479601 -0.681053 1.378023
C  0.180798 0.64677 0.769066
C  0.386361 -1.61228 0.207463
C  1.073383 0.644937 -0.507034
C  1.271571 -0.862869 -0.826181
C  -1.330129 0.71951 0.382053
C  -1.089191 -1.75969 -0.263232
C  -1.699454 -0.379917 -0.63604
H  0.444602 1.472509 1.459012
H  0.806591 -2.598242 0.473748
H  0.558554 1.19655 -1.318662
H  2.335437 -1.095249 -0.652962
H  1.016832 -1.117806 -1.868767
H  -1.919982 0.580619 1.317795
H  -1.673101 -2.227917 0.555768
H  -1.156301 -2.441698 -1.133677
H  -0.153475 -0.933303 2.153749
H  -1.329471 -0.056706 -1.627537
H  -2.799238 -0.445484 -0.72127
H  2.320079 2.199856 -0.155719
H  -1.582741 2.731515 0.411786
