program: Gaussian 09
title: 000129925
version: EM64L-G09RevD.01
frameworkgroup: C1[X(C11H12N2O)]
method: RPBEPBE
basis: SDD
operation: Freq
keyword: #p
keyword: freq=noraman
keyword: PBEPBE/SDD
title: #p freq=noraman PBEPBE/SDD
converged: YES YES NO NO
title: Mulliken charges:
elementType: O N N C C C C C C C C C C C H H H H H H H H H H H H
charge: -0.431759 -0.168063 -0.116507 -0.532018 0.469784 0.237288 -0.207956 -0.343885 -0.391387 -0.757180 -0.343539 -0.387583 -0.342027 0.284727 0.233619 0.234913 0.257118 0.259769 0.231738 0.221541 0.264304 0.244607 0.249506 0.223688 0.253759 0.355544
chargesum: 0.00000
title: Mulliken charges with hydrogens summed into heavy atoms:
elementType: O N N C C C C C C C C C C C
charge: -0.076215 -0.168063 -0.116507 -0.063486 0.469784 0.237288 0.049162 -0.084116 -0.159649 -0.026727 -0.094034 -0.163895 -0.088269 0.284727
polarizability: 1.64224342e+02 1.22892219e+01 1.21798956e+02 6.20498222e+00 -6.25387258e+00 9.78591331e+01
1716.lowfreq: -11.5665 -4.8878 0.0003 0.0005 0.0006 3.2896 23.1724 35.3333 58.2098
frequency: 18.4046 35.1597 58.2092 125.9570 128.9187 204.1482 244.7715 256.0313 299.5118 323.2746 362.3262 392.7529 409.5014 410.5308 495.1156 517.7218 618.5010 633.3881 662.2349 677.9980 699.5363 728.1796 750.5164 759.5262 810.4777 823.8902 827.8571 835.5463 893.7912 929.4186 960.7594 967.2736 971.6330 1004.0329 1047.4153 1059.4759 1105.1188 1120.0933 1144.6737 1157.3078 1181.6930 1197.3979 1228.7988 1250.9647 1268.1874 1299.5050 1338.5554 1349.5388 1390.4504 1397.1420 1401.8929 1428.0122 1457.8063 1464.6294 1469.1099 1488.7499 1507.7375 1508.2933 1598.8793 1630.0721 2976.2057 2991.6489 3040.5052 3049.7174 3116.6135 3118.8865 3120.6437 3148.5613 3171.8827 3218.9931 3247.3491 3582.3493
redmass: 3.8586 3.6397 5.9225 4.7199 1.0789 4.3339 3.8380 2.5902 4.6734 3.7682 1.1215 3.5979 2.6532 2.9103 3.5055 3.8707 4.1235 5.3259 4.7855 4.5828 3.1526 1.2942 4.4422 4.0765 1.4569 2.0821 2.3035 1.3943 5.2409 1.4448 1.3578 1.6953 1.8659 2.8238 1.4673 1.4917 1.4369 2.0898 1.3552 2.0440 1.1149 2.6449 2.1295 2.8612 2.0909 1.5064 1.3605 2.8211 2.7077 1.6540 2.7873 2.7513 1.1526 1.7961 1.1435 1.7299 2.8205 3.7208 6.5374 6.2318 1.0398 1.0595 1.1027 1.0971 1.0890 1.0962 1.0900 1.0953 1.0950 1.0905 1.1090 1.0661
irintensity: 2.7670 0.0211 2.4681 1.3454 0.1283 0.6942 10.4001 1.6508 1.9492 0.5194 146.4038 4.6843 8.1645 3.3152 21.0997 17.6508 3.3907 0.1388 8.2413 7.4282 4.9871 69.0023 9.1466 7.6900 39.6529 15.0012 18.9144 10.3267 0.6946 3.7833 0.1993 8.3474 4.2837 4.7264 4.9500 14.2590 65.4516 11.7294 211.1529 5.9672 8.8071 1.0914 4.9325 23.6534 55.0044 6.2640 41.0149 4.9437 34.9066 12.7445 42.7167 11.7228 8.3914 10.2368 21.5274 11.5785 88.2332 22.8494 15.2771 31.7918 26.1321 31.5839 10.2001 18.5954 18.6302 7.4556 11.6138 5.8799 6.2649 2.6705 5.9377 41.3303
temp: 298.150 k
press: 1.00000 atm
elementType: 8 7 7 6 6 6 6 6 6 6 6 6 6 6 1 1 1 1 1 1 1 1 1 1 1 1
symmnumber: 1
zpe: 544969.3 jmol-1
zpe.correction: 0.207568 hartree
zpe.thermalcorrener: 0.220212 hartree
zpe.thermalcorrenthalpy: 0.221157 hartree
zpe.thermalcorrgfe: 0.166756 hartree
zpe.sumelectzpe: -610.077248 hartree
zpe.sumelectthermal: -610.064603 hartree
zpe.sumelectthermalent: -610.063659 hartree
zpe.sumelectthermalfe: -610.118060 hartree
dipole: 2.6655 0.0038 -1.9275
dipole: 3.2894
quadrupole: -98.6887 -71.2217 -81.8695
quadrupole: -6.7090 10.0544 -2.1712
quadrupole: -14.7621 12.7049 2.0572 -6.7090 10.0544 -2.1712
hfenergy: -610.2848156 hartree
pointgroup: C01 [X(C11H12N2O1)]
dipole: 1.073718 0.2269426 0.6858716 debye
dipolederiv: -1.3694463 -0.0794978 0.4428216 -0.0805199 -0.2429888 -0.1623995 0.5080549 -0.1621472 -0.4421807 -0.6522014 0.123678 -0.2295398 0.1987307 -0.2025128 0.1271422 -0.3573503 0.070504 -0.3560102 -0.496799 0.0890201 -0.0777364 0.0922034 -0.3980335 -0.0297304 -0.1921789 0.0354768 -0.357193 0.665815 -0.0436816 0.0580419 -0.055836 0.2401833 -0.0785594 0.2421337 -0.0369746 0.3225162 -0.0066344 0.0129852 -0.0779852 -0.013255 -0.1378291 0.0882098 -0.2249799 0.0768122 -0.1514051 0.3451057 -0.1030466 0.1917189 0.1048855 0.3148106 0.1499739 0.4215875 0.0104666 0.2620849 0.0390035 -0.1274443 0.1501462 -0.3865117 -0.0399751 -0.1458822 0.144977 -0.0464174 -0.1020208 0.0190536 0.0251062 -0.0696487 -0.04241 -0.0245598 -0.0797036 0.0487381 -0.1180118 0.0184241 0.0602578 -0.0918567 -0.0047961 -0.0823338 0.0022114 -0.147653 -0.0311627 -0.1251967 0.0258355 0.0284671 0.058291 -0.0207452 0.0225977 -0.0832245 -0.0677392 -0.0767086 -0.0257668 0.0543476 -0.0880562 -0.1067945 0.1035584 -0.104328 0.1232336 0.0642658 0.0525721 0.0354041 -0.0435591 -0.3542649 -0.059263 0.1164385 0.1549682 -0.0897492 -0.1774779 -0.1100801 -0.0919595 -0.0529149 -0.2041416 -0.0275469 0.0176313 -0.2232347 -0.0554681 -0.0094243 0.2724238 -0.0966237 -0.1707217 1.2488516 0.0252185 -0.5034324 0.0514621 0.0589745 -0.0006534 -0.5710389 0.0021686 0.3013753 -0.0294163 -0.0060474 -0.0073529 -0.0289666 -0.0719651 0.125707 -0.0070143 0.0522496 0.0508111 -0.0788968 0.0347757 0.0427097 0.0582124 0.0170706 -0.1388001 0.0106743 -0.0532206 -0.0421149 0.1598635 -0.0336198 -0.097273 0.0001198 0.0609284 -0.06511 -0.0909871 -0.0967486 0.0734324 0.0633846 0.0849059 -0.0275021 0.0969379 0.0584534 0.0500769 -0.0642986 0.0451145 0.0792332 0.0876177 -0.0367832 0.0686389 -0.020871 0.0428478 0.1161261 0.0461602 0.1137743 -0.00265 0.107813 -0.0002851 0.0308013 0.0094171 -0.0606196 0.0544965 0.0565773 0.1363727 -0.0486687 0.0442855 -0.0583485 -0.0939935 -0.0048486 0.0946165 -0.0199592 -0.0846753 -0.0782496 0.0019685 -0.0987481 0.0712448 0.0663987 0.0446414 0.02955 0.0024382 0.0746312 -0.0049767 0.0901726 0.0828513 0.1089983 -0.0510256 0.0940539 0.0031043 0.0006377 -0.0748821 0.0244267 0.1310229 0.0350164 -0.0216121 0.0755822 -0.0265736 0.0674851 0.1195417 0.0841659 0.125104 0.0013505 0.0021585 0.0854869 -0.0265008 0.0884625 0.0755226 0.0647547 -0.0189335 0.0608376 0.1165539 0.3890603 0.0761169 -0.0769559 0.0529961 0.2179335 0.1597218 -0.0584058 0.1475814 0.2403104 unknown
polarizability: 160.7617468|-18.8604367|115.4117216|-1.03469|-13.4034858|107.7089627 unknown
InChI: InChI=1S/C11H12N2O/c1-9-12-6-7-13(9)8-10-2-4-11(14)5-3-10/h2-7,14H,8H2,1H3
charge 0 multiplicity 1
26 atoms
O  4.542757 -0.18288 -0.81197
N  -1.826743 0.320358 0.63587
N  -3.355052 0.285062 -1.036394
C  -0.732686 -0.100857 1.524384
C  0.643151 -0.119685 0.855807
C  -2.414057 -0.438131 -0.385825
C  -2.430005 1.589698 0.615136
C  0.953352 0.740522 -0.223838
C  1.652037 -0.988479 1.344557
C  -2.043541 -1.858624 -0.686628
C  -3.367228 1.546245 -0.416864
C  2.241987 0.741181 -0.800647
C  2.944017 -0.995964 0.783567
C  3.238265 -0.126383 -0.291885
H  -0.962328 -1.105022 1.92783
H  -0.725475 0.592144 2.387058
H  -2.148379 2.371524 1.316398
H  0.182579 1.40705 -0.626266
H  1.428243 -1.671512 2.17378
H  -2.264836 -2.537317 0.15992
H  -2.635576 -2.189279 -1.553549
H  -0.970056 -1.966368 -0.929527
H  -4.04512 2.329077 -0.74892
H  2.464586 1.410427 -1.641999
H  3.726207 -1.664878 1.153957
H  4.652301 0.451392 -1.563252
