program: Gaussian 09
title: 000129916
version: EM64L-G09RevD.01
frameworkgroup: C1[X(C9H10FNO4)]
method: RPBEPBE
basis: SDD
operation: Freq
keyword: #p
keyword: freq=noraman
keyword: PBEPBE/SDD
title: #p freq=noraman PBEPBE/SDD
converged: YES YES NO NO
title: Mulliken charges:
elementType: F O O O O N C C C C C C C C C H H H H H H H H H H
charge: -0.217855 -0.472956 -0.406461 -0.426934 -0.234009 -0.599016 -0.596913 -0.142452 0.432536 0.080790 -0.370250 -0.003769 0.177236 -0.346000 0.177489 0.247342 0.216927 0.259729 0.238350 0.254013 0.272381 0.306247 0.389728 0.378596 0.385254
chargesum: 0.00000
title: Mulliken charges with hydrogens summed into heavy atoms:
elementType: F O O O O N C C C C C C C C C
charge: -0.217855 -0.083229 -0.027865 -0.041680 -0.234009 -0.020388 -0.132645 0.117277 0.432536 0.080790 -0.131900 -0.003769 0.177236 -0.091987 0.177489
polarizability: 1.59773277e+02 5.29054887e+00 1.23255514e+02 -1.95849406e+01 4.65306858e+00 7.38801416e+01
1716.lowfreq: -5.5669 -0.0008 -0.0006 -0.0003 6.2201 8.2529 30.5924 44.8303 57.4597
frequency: 30.5499 44.8234 57.4535 74.8628 134.8987 155.7262 208.6066 241.0567 258.0227 269.7552 283.0200 292.4699 300.3888 307.4470 355.4708 371.9631 445.5849 468.6306 478.1217 496.9241 515.0774 527.1007 564.1344 586.9661 600.7243 619.2575 654.2809 700.2467 722.0534 756.6425 769.9537 809.5760 914.3295 924.4610 930.0296 953.6292 1010.2511 1057.5901 1112.1054 1130.0617 1139.7029 1160.4596 1181.9677 1187.4455 1225.5184 1260.7104 1269.8559 1286.5950 1315.0998 1358.3520 1399.6395 1412.8829 1453.0499 1463.0438 1512.5083 1605.4324 1607.3239 1643.5926 1668.9082 2998.2195 3024.3194 3066.9397 3138.1462 3179.1572 3489.0401 3506.9368 3531.6706 3589.9743 3630.4530
redmass: 6.8514 8.2100 7.4329 5.8332 6.8777 10.2053 5.0161 1.6311 5.4216 4.4941 5.2798 2.9332 2.8402 2.4661 1.1793 4.1672 5.3430 1.1173 8.3015 1.5637 3.5464 4.2964 4.0872 2.5826 2.6514 2.0930 7.0769 5.0607 4.6958 5.3622 2.7553 1.5157 3.8192 1.6542 1.9231 4.0498 2.9959 2.7160 1.5174 1.6779 1.8432 1.6829 1.3827 1.5431 3.0031 1.7393 1.7011 1.3177 1.1782 2.0140 2.1773 3.9428 4.3130 1.1571 4.0003 5.1354 1.4088 8.4987 3.6732 1.0605 1.0862 1.1028 1.0898 1.0952 1.0448 1.0638 1.0652 1.0659 1.0998
irintensity: 0.2221 1.1663 0.2008 1.4236 1.2665 0.2328 4.9187 55.5108 5.1970 10.0618 4.3858 11.0027 2.0254 12.6635 180.4957 8.0986 26.5300 134.1930 1.7466 188.5469 116.4420 2.5914 18.8859 26.4120 24.9979 157.6543 17.3709 28.3796 12.9074 6.3264 1.3941 38.0686 39.0137 7.3104 13.1792 16.3208 87.7813 220.4616 32.6777 51.2329 46.1583 104.5426 27.7483 12.7695 232.5759 19.2415 4.5125 1.3785 6.3255 35.0926 25.2611 7.3948 78.9514 14.6484 72.2196 4.0690 213.9194 28.3784 149.6285 26.7422 19.5942 11.2801 8.3581 4.3398 15.7558 21.5078 86.9132 76.0647 12.3126
temp: 298.150 k
press: 1.00000 atm
elementType: 9 8 8 8 8 7 6 6 6 6 6 6 6 6 6 1 1 1 1 1 1 1 1 1 1
symmnumber: 1
zpe: 481145.2 jmol-1
zpe.correction: 0.183259 hartree
zpe.thermalcorrener: 0.198253 hartree
zpe.thermalcorrenthalpy: 0.199197 hartree
zpe.thermalcorrgfe: 0.140739 hartree
zpe.sumelectzpe: -803.318259 hartree
zpe.sumelectthermal: -803.303265 hartree
zpe.sumelectthermalent: -803.302320 hartree
zpe.sumelectthermalfe: -803.360779 hartree
dipole: -0.5561 0.2027 -0.9628
dipole: 1.1302
quadrupole: -97.6873 -75.3177 -86.9772
quadrupole: 12.4642 -2.4970 -4.6990
quadrupole: -11.0266 11.3430 -0.3165 12.4642 -2.4970 -4.6990
hfenergy: -803.5015175 hartree
pointgroup: C01 [X(C9H10F1N1O4)]
dipole: 0.2329974 0.0796726 0.3702621 debye
dipolederiv: -0.4350013 -0.233116 0.1606547 -0.2578124 -0.6298108 0.2627289 0.1433044 0.2306331 -0.2676781 -0.3633936 0.3468912 -0.1442441 0.4520186 -1.1970049 0.0969049 -0.1543973 0.0857805 -0.3771865 -0.6621565 0.137052 0.3309321 0.1947415 -0.2827629 -0.2489357 0.2604797 -0.1778858 -0.8058959 -1.4092812 0.270513 0.2316021 0.3412024 -0.2207067 -0.1583829 0.2792523 -0.1508537 -0.4502636 -0.7502434 -0.096909 0.2466154 -0.4355902 -0.6556419 0.0658317 0.2418105 -0.0483121 -0.497373 -1.0403235 0.1725133 -0.1800939 0.299404 -0.3218207 0.0114433 -0.2492857 0.0713324 -0.5991087 -0.059769 0.1220578 0.0211721 -0.0434167 0.0528424 -0.0288431 -0.2089127 0.0893104 0.1060912 0.705423 -0.2940944 0.0199155 -0.3196477 0.0066077 -0.1073582 0.0726179 -0.1044208 0.263525 0.0529733 -0.0113165 -0.0209018 -0.0197254 -0.1573854 0.03054 -0.0985566 0.0435449 -0.1036574 0.4259105 0.2965843 -0.2109619 0.2085928 0.5523792 -0.2395907 -0.1362602 -0.2434458 0.1945163 0.0058622 0.0879888 -0.1023177 -0.0529899 0.0398075 -0.0306325 -0.0366577 -0.0995259 -0.1239242 -0.1462446 -0.2701017 0.1433286 -0.5302892 0.9377283 -0.1042182 0.2210894 -0.1514349 -0.0046252 0.9967974 0.0930916 -0.6176703 0.5184027 0.9271946 0.2590673 -0.5693411 0.2328823 0.8407931 -0.1857342 -0.0158336 -0.001891 0.2314065 0.012994 -0.1121794 -0.0499497 -0.0415556 -0.1274411 1.2655267 -0.3582103 -0.3037315 -0.2150752 0.0155941 0.0825847 -0.397397 0.1481976 0.1514372 0.0022466 -0.0059637 0.0488256 -0.0317746 0.0351756 0.1009695 0.0438761 0.0366029 -0.0214751 -0.0176701 -0.0068632 -0.0000085 0.0536274 -0.1197331 -0.0916443 0.0012894 -0.0617364 0.0450248 -0.0090492 -0.0139365 0.0710886 -0.047062 0.0245514 0.0594247 0.0558306 0.0451972 -0.0555379 0.0615461 0.0938827 0.0169828 0.073719 -0.0489973 0.0262115 0.0106956 0.0194198 0.1308265 0.0417635 -0.0575224 0.0596623 -0.05745 0.0348403 0.0565583 0.0671703 0.056592 0.1352788 0.2673172 -0.089786 0.0433229 -0.0834859 0.1040193 -0.0844637 0.1606025 -0.1718173 0.2552376 0.2845203 0.0179416 0.0563237 -0.0287306 0.1798858 0.0796548 0.1452024 0.0486994 0.2213907 0.2124337 -0.0796931 0.1038418 -0.0854569 0.419001 0.0143923 0.1063338 0.020682 0.3572447 0.307992 -0.0600485 0.0286693 -0.0771186 0.1074899 -0.020599 0.0863998 0.0493151 0.3628087 0.4485538 -0.0451218 -0.0011168 -0.0874896 0.1837528 0.0805356 0.0048032 0.0727986 0.3699922 unknown
polarizability: 157.7526446|-9.2249519|123.9465869|-21.3803402|-5.2215405|75.209701 unknown
InChI: InChI=1S/C9H10FNO4/c10-7-4(3-5(11)9(14)15)1-2-6(12)8(7)13/h1-2,5,12-14H,3,11H2
charge 0 multiplicity 1
25 atoms
F  -0.02959 -1.569929 1.201886
O  2.614655 -2.04774 0.35108
O  -1.683779 -0.928859 -1.545444
O  4.105408 -0.023359 -0.764456
O  -3.437069 -1.295111 -0.068081
N  -3.717634 1.456781 0.204776
C  -1.309996 1.061287 0.953854
C  -2.407977 0.94501 -0.190809
C  0.11336 0.786731 0.514963
C  0.702621 -0.484062 0.636847
C  0.931799 1.792965 -0.064875
C  2.011379 -0.78253 0.230395
C  -2.593157 -0.520315 -0.571759
C  2.252048 1.534382 -0.494484
C  2.799174 0.243321 -0.34854
H  -1.614401 0.397606 1.783329
H  -1.380178 2.103213 1.319475
H  -2.025719 1.487611 -1.074471
H  0.523017 2.803555 -0.175188
H  2.871439 2.318421 -0.93798
H  -3.734958 2.407959 0.574164
H  -4.305809 0.783709 0.702798
H  1.999439 -2.691744 0.782163
H  -1.806405 -1.90143 -1.723008
H  4.320135 -0.975973 -0.582437
