program: Gaussian 09
title: 000012062
version: EM64L-G09RevD.01
frameworkgroup: C1[X(C7H8N2O2)]
method: RPBEPBE
basis: SDD
operation: Freq
keyword: #pfreq=noraman
keyword: PBEPBE/SDD
title: #p freq=noraman PBEPBE/SDD
converged: YES YES NO YES
title: Mulliken charges:
elementType: O O N N C C C C C C C H H H H H H H H
charge: -0.445029 -0.262715 -0.714054 -0.715348 0.350441 0.587309 0.590898 -0.590283 -0.620931 -0.616341 0.098332 0.263299 0.260471 0.207553 0.302583 0.312261 0.310506 0.302539 0.378510
chargesum: 0.00000
title: Mulliken charges with hydrogens summed into heavy atoms:
elementType: O O N N C C C C C C C
charge: -0.066519 -0.262715 -0.099210 -0.102303 0.350441 0.587309 0.590898 -0.326985 -0.360460 -0.408788 0.098332
polarizability: 1.34941446e+02 -5.46121375e-01 1.28581624e+02 -9.62769923e-03 4.75726130e-03 4.13456912e+01
1716.lowfreq: -5.4138 -0.0008 -0.0006 -0.0004 5.2023 6.2284 61.0694 140.7092 168.5414
frequency: 61.0669 140.7088 168.5413 214.4226 225.1708 286.7225 345.3595 356.4798 365.3106 368.6219 384.3590 389.3453 490.2829 496.0101 543.7684 561.3998 602.6767 619.6736 624.0323 687.3921 738.3947 848.4741 853.0818 895.6749 899.1701 974.8883 990.5884 1019.0727 1072.9275 1076.8364 1137.6609 1222.4592 1289.8709 1298.2139 1404.2599 1415.6442 1483.8715 1494.0754 1608.4982 1627.0412 1638.7576 1644.8024 1646.4785 3109.8865 3152.8114 3169.4573 3527.5450 3570.8876 3571.7071 3712.3396 3712.5840
redmass: 9.8540 5.0499 5.7490 3.7038 3.3162 3.3179 1.2128 1.1466 1.1158 5.4695 1.0380 5.2428 2.8521 4.2488 5.3947 4.7915 1.4217 3.4146 4.5280 1.6383 4.2081 1.5727 1.5490 2.4225 6.0779 5.9216 2.3845 1.8376 1.4489 1.8338 1.3383 1.6761 1.7024 1.5759 5.4088 7.6664 4.6794 3.8334 5.3589 5.4158 1.2775 1.2525 4.7982 1.0909 1.0919 1.0923 1.0640 1.0448 1.0450 1.1041 1.1040
irintensity: 1.1241 7.7995 1.3847 9.6728 0.0012 7.2828 4.4918 340.2322 255.6432 3.4614 4.8684 0.6481 25.9237 3.0407 11.6132 1.7887 128.1034 11.9853 43.3347 3.3048 56.3920 9.7503 3.8474 96.7688 49.3658 20.6781 46.7198 54.9099 39.1608 103.6718 103.6737 78.4700 30.3219 8.5159 147.3705 46.4509 44.1737 12.5622 79.0555 429.8068 276.4037 140.4507 97.8211 25.3700 4.7093 3.3889 36.6914 95.4328 29.5827 18.2673 22.7030
temp: 298.150 k
press: 1.00000 atm
elementType: 8 8 7 7 6 6 6 6 6 6 6 1 1 1 1 1 1 1 1
symmnumber: 1
zpe: 381245.7 jmol-1
zpe.correction: 0.145209 hartree
zpe.thermalcorrener: 0.155685 hartree
zpe.thermalcorrenthalpy: 0.156629 hartree
zpe.thermalcorrgfe: 0.109755 hartree
zpe.sumelectzpe: -530.719585 hartree
zpe.sumelectthermal: -530.709109 hartree
zpe.sumelectthermalent: -530.708164 hartree
zpe.sumelectthermalfe: -530.755038 hartree
dipole: -3.9644 1.4559 0.0016
dipole: 4.2233
quadrupole: -49.5295 -50.0964 -69.5793
quadrupole: 6.6962 -0.0053 0.0014
quadrupole: 6.8722 6.3053 -13.1776 6.6962 -0.0053 0.0014
hfenergy: -530.8647935 hartree
pointgroup: C01 [X(C7H8N2O2)]
dipole: 1.5721365 -0.5377751 0.0006397 debye
dipolederiv: -0.7340827 -0.4437012 -0.0000457 -0.6151682 -0.9280265 -0.0000804 -0.0000585 -0.0000648 -0.4246159 -1.0251192 0.2868864 -0.0000633 0.2589538 -0.8112927 0.000007 -0.0000812 0.0000287 -0.3364194 -0.5073698 -0.6488592 0.0001337 -0.6400221 -1.1177789 0.0000387 0.0002222 0.000181 -0.7609465 -0.4573367 0.6229369 0.0000659 0.6122179 -1.1646666 -0.0000095 0.0001679 -0.0001844 -0.7616783 -0.6783165 0.0150095 -0.0000888 0.0302297 0.4959443 -0.0000326 -0.0000713 -0.0000317 0.0718333 0.6054334 0.791624 -0.0000468 0.6521476 1.2324399 -0.000045 -0.0000311 -0.0000222 0.1856406 0.5241368 -0.7549645 0.0000388 -0.6277112 1.2884124 -0.0000805 0.000042 -0.0001094 0.1844614 -0.2449205 0.5091873 -0.0000141 -0.1535027 -0.3880921 0.0000008 0.0000152 0.0000866 -0.2788175 -0.2915545 -0.5170262 0.0000399 0.1507254 -0.3700014 0.0000166 0.0000014 -0.0000569 -0.2769088 0.0473691 -0.0145023 0.0000265 -0.0096976 -0.6632094 0.0000221 0.0000146 0.0000216 -0.3157543 2.0322762 0.0580058 0.0001943 0.1806804 1.3844066 0.0000596 0.0002036 0.0000267 0.2130962 0.0942289 -0.0384083 -0.0000046 -0.0473273 -0.0292548 0.0000081 -0.0000082 0.0000022 0.1872546 0.0930637 0.0488939 -0.0000099 0.0301108 -0.0269585 0.0000146 -0.0000129 0.0000171 0.1847311 -0.1626341 0.0044014 -0.0000363 0.0041918 0.0584826 0.0000078 -0.0000235 0.0000091 0.1803869 0.1444604 0.0538312 -0.0000624 0.0471121 0.164955 0.0000157 -0.000129 -0.0000532 0.3880048 0.1254921 0.0290624 -0.0000234 0.040196 0.2115792 -0.0000112 -0.0000514 -0.0000907 0.3887205 0.1237137 -0.0276851 -0.0000186 -0.0368715 0.2110614 0.0000386 -0.000047 0.0001344 0.3882093 0.139509 -0.0521276 -0.0000625 -0.0457278 0.1688416 0.0000143 -0.0001379 0.000099 0.3875827 0.1716509 0.0774354 -0.0000227 0.1694629 0.2831576 0.0000151 -0.0000149 0.000007 0.3952193 unknown
polarizability: 134.9626752|-0.4034616|128.5603948|0.0097316|-0.0045409|41.3456912 unknown
InChI: InChI=1S/C7H8N2O2/c8-5-1-4(7(10)11)2-6(9)3-5/h1-3,10H,8-9H2
charge 0 multiplicity 1
19 atoms
O  -2.855202 -1.168229 -0.000357
O  -2.922265 1.147845 -0.000323
N  2.107679 2.408013 -0.000006
N  2.014648 -2.480396 0.000283
C  -0.749764 0.016134 -0.000111
C  1.383907 1.213757 0.00003
C  1.336131 -1.259326 0.000177
C  -0.086149 -1.232247 0.000032
C  -0.037256 1.237748 -0.000109
C  2.059793 -0.036613 0.000183
C  -2.233923 0.09609 -0.000253
H  -0.669524 -2.156945 0.000016
H  -0.594984 2.179859 -0.000216
H  3.157883 -0.057935 0.000279
H  3.122845 2.406445 0.000268
H  1.626363 3.30193 0.000028
H  1.500651 -3.355851 0.000451
H  3.029154 -2.516575 0.000592
H  -3.839888 -1.027105 -0.000464
