program: Gaussian 09
title: 000129968
version: EM64L-G09RevD.01
frameworkgroup: C1[X(C20H19N5O2)]
method: RPBEPBE
basis: SDD
operation: Freq
keyword: #p
keyword: freq=noraman
keyword: PBEPBE/SDD
title: #p freq=noraman PBEPBE/SDD
converged: YES YES NO NO
title: Mulliken charges:
elementType: O O N N N N N C C C C C C C C C C C C C C C C C C C C H H H H H H H H H H H H H H H H H H H
charge: -0.269199 -0.300251 -0.009069 -0.036056 -0.129422 -0.359050 -0.003406 -0.412713 -0.281515 -0.417846 0.037823 0.430740 -0.101540 0.388811 -0.364032 0.435763 0.081777 -0.536738 -0.344803 -0.296094 -0.405479 -0.394640 -0.322508 -0.385266 -0.192616 -0.250423 -0.221883 0.229469 0.249408 0.205148 0.206957 0.223372 0.228277 0.238689 0.241226 0.264055 0.274382 0.243387 0.253063 0.234897 0.261849 0.257459 0.225732 0.230539 0.232305 0.359420
chargesum: 0.00000
title: Mulliken charges with hydrogens summed into heavy atoms:
elementType: O O N N N N N C C C C C C C C C C C C C C C C C C C C
charge: -0.269199 -0.300251 -0.009069 -0.036056 -0.129422 0.000370 -0.003406 0.066164 0.130590 0.033803 0.037823 0.430740 -0.101540 0.388811 0.115882 0.435763 0.081777 -0.272683 -0.070421 -0.052707 -0.152416 -0.159743 -0.060659 -0.127806 0.033116 -0.019883 0.010423
polarizability: 4.11377657e+02 1.66032308e+01 2.59349417e+02 2.94316467e+00 2.66945918e+00 1.32416097e+02
1716.lowfreq: -2.7889 -1.9195 -0.0006 0.0006 0.0013 4.0415 9.9253 14.2800 19.6357
frequency: 9.8094 14.2426 19.6092 23.1570 30.2006 49.3133 55.3098 77.0779 88.2174 106.3362 139.5905 145.8122 173.7124 174.3936 187.4444 230.9874 232.6418 239.5180 271.2637 288.6332 321.8111 373.8663 396.7860 416.7594 446.6177 452.1228 477.4481 487.1437 508.7231 518.5257 523.3191 576.2615 602.8492 604.0245 617.9532 635.7414 661.9793 683.2564 696.9835 720.0323 721.1881 752.7727 753.0747 758.8029 767.5991 770.1262 779.1219 797.7955 843.3951 846.6739 860.3149 868.7740 871.6094 889.7851 909.1287 916.9230 940.5758 952.6149 961.1399 966.1401 975.8871 992.5076 993.1875 996.8570 1006.9429 1014.5019 1016.5203 1027.9217 1040.6772 1048.8695 1083.7418 1089.7589 1098.2917 1111.5226 1142.4507 1144.2156 1146.4019 1159.2847 1166.5837 1180.9061 1205.2505 1227.8274 1228.7912 1242.2119 1252.1046 1268.7488 1276.2950 1282.6150 1290.4974 1295.6713 1301.1832 1337.2288 1339.1479 1372.5402 1381.1097 1399.7859 1402.1603 1407.1102 1422.3257 1440.4466 1453.4687 1460.3487 1465.2371 1471.5321 1474.2383 1479.8381 1492.1623 1507.1318 1553.8512 1591.9190 1596.4129 1614.9833 1626.2764 2941.8264 2960.9716 2998.0268 2998.9624 3017.6261 3020.0360 3059.9226 3089.7891 3121.2064 3130.6025 3136.6284 3139.8478 3154.8360 3169.9235 3170.8475 3175.0938 3180.5658 3192.0341 3607.0357
redmass: 4.7720 8.2419 6.8738 5.2032 5.6983 3.9986 5.3896 4.6852 7.1800 2.6777 2.4258 2.5232 6.2078 4.5045 6.0213 5.2203 6.2527 4.9763 4.9855 3.8971 2.9367 4.8880 3.4378 4.7162 5.0047 2.9634 2.9261 6.1239 5.3759 6.6289 3.2202 6.7150 7.7771 4.8153 7.4128 6.7925 3.3852 1.9946 5.6985 2.1862 1.8616 3.6782 1.9530 1.2796 3.8293 1.4336 2.5750 2.7818 1.4716 1.4816 1.4352 5.2500 1.3761 1.7639 5.5718 5.5780 4.3517 9.8252 1.3077 1.3605 6.0627 3.3153 1.7034 1.3425 9.3792 1.7221 2.1761 3.7219 3.8556 1.8335 1.9289 2.0877 6.4682 1.7460 3.8609 1.6328 1.3754 1.6900 1.1066 1.2307 1.0679 1.7690 1.8569 2.1198 3.3579 1.2998 2.3583 1.1497 1.8729 1.9002 1.3106 2.0929 1.4559 2.2172 1.6054 4.6268 1.6095 5.0846 2.2356 2.7550 1.3486 1.5188 2.1813 1.6239 2.0191 1.5466 1.2192 3.5401 7.5241 6.7608 6.5420 6.6064 6.6791 1.0549 1.0560 1.0684 1.0990 1.0599 1.1048 1.0999 1.1045 1.0872 1.0911 1.0891 1.0876 1.0949 1.0995 1.0920 1.0912 1.0976 1.0949 1.0846
irintensity: 0.5381 3.2644 0.1308 1.3367 0.4986 1.0524 1.0325 0.5975 0.2777 1.3481 9.8084 1.2037 2.6106 5.5112 1.5393 0.3681 0.4057 0.6589 2.6402 2.2357 7.1498 0.6587 0.6760 14.1312 8.8342 3.7618 11.2596 1.3868 6.4234 0.9010 0.3224 8.0592 1.9804 0.0407 4.1714 14.7565 1.2672 22.9355 5.4925 61.5753 57.8905 4.8336 2.0778 58.4651 7.2862 30.0683 11.7225 12.9914 2.5214 113.5204 0.0197 4.9459 4.9714 5.7627 19.2331 4.8859 13.5945 16.3786 1.0745 4.4873 4.5894 26.9809 10.9172 0.1143 6.3566 1.1482 3.2354 166.3789 25.8491 11.4116 18.1093 2.5570 19.2760 11.3430 4.6648 325.3682 127.4263 0.1854 0.5050 60.3343 1.0971 16.9283 7.0944 46.2743 92.7348 13.0283 10.6341 2.6553 10.7181 5.6941 6.9799 43.9993 4.1222 1.4488 51.1373 25.3141 6.6242 3.5013 35.2074 34.1495 22.2022 70.2360 57.9320 45.1944 2.5051 117.3035 0.1634 51.2916 14.0774 186.9826 4.1274 274.9745 5.8964 32.2320 22.0954 13.8131 27.9006 22.7392 19.5645 0.7730 30.1432 2.9188 9.5205 12.4918 14.8765 25.9828 26.2109 12.6282 6.1497 3.7460 3.1849 112.5456
temp: 298.150 k
press: 1.00000 atm
elementType: 8 8 7 7 7 7 7 6 6 6 6 6 6 6 6 6 6 6 6 6 6 6 6 6 6 6 6 1 1 1 1 1 1 1 1 1 1 1 1 1 1 1 1 1 1 1
symmnumber: 1
zpe: 939489.0 jmol-1
zpe.correction: 0.357832 hartree
zpe.thermalcorrener: 0.381051 hartree
zpe.thermalcorrenthalpy: 0.381995 hartree
zpe.thermalcorrgfe: 0.298822 hartree
zpe.sumelectzpe: -1195.757433 hartree
zpe.sumelectthermal: -1195.734214 hartree
zpe.sumelectthermalent: -1195.733270 hartree
zpe.sumelectthermalfe: -1195.816443 hartree
dipole: -0.7251 -3.1764 -1.9292
dipole: 3.7864
quadrupole: -134.2204 -140.5191 -167.9794
quadrupole: -4.7663 -21.3051 1.5095
quadrupole: 13.3525 7.0539 -20.4064 -4.7663 -21.3051 1.5095
hfenergy: -1196.1152651 hartree
pointgroup: C01 [X(C20H19N5O2)]
dipole: -0.3137087 -1.1362937 -0.9108424 debye
polarizability: 411.5275169|16.2248458|256.2956836|-2.5707853|18.9347858|135.3199698 unknown
InChI: InChI=1S/C20H19N5O2/c1-2-8-19-15(5-1)10-11-16(21-19)14-27-18-7-3-6-17(13-18)26-12-4-9-20-22-24-25-23-20/h1-3,5-8,10-11,13,24H,4,9,12,14H2
charge 0 multiplicity 1
46 atoms
O  3.371953 1.762037 0.078624
O  -1.421486 0.95799 0.124879
N  -5.059773 0.643452 0.114831
N  7.681353 -1.945212 -1.594803
N  7.793563 -1.414445 0.639495
N  8.955533 -2.004579 -1.09307
N  9.064481 -1.689728 0.255068
C  5.127588 0.139471 -0.206913
C  3.610552 0.325283 -0.127583
C  5.491889 -1.346617 -0.467575
C  -3.757539 0.292722 0.119331
C  -5.647633 -1.764944 -0.048269
C  -6.010869 -0.363646 0.032595
C  2.041515 2.198859 0.180275
C  -2.794116 1.462062 0.225943
C  -0.378449 1.898266 0.215239
C  6.972003 -1.572379 -0.483548
C  0.921045 1.344174 0.101974
C  -3.303408 -1.064726 0.041602
C  -4.251201 -2.085496 -0.041546
C  1.874878 3.595888 0.371891
C  -6.681586 -2.752825 -0.131131
C  -7.395716 0.000004 0.02663
C  -0.568787 3.286713 0.403665
C  0.575501 4.119392 0.480317
C  -8.02502 -2.370717 -0.134649
C  -8.382685 -0.985537 -0.05553
H  5.528001 0.775202 -1.017484
H  5.591083 0.477175 0.736763
H  3.117565 -0.005175 -1.066664
H  3.18241 -0.251769 0.719466
H  5.043261 -1.97715 0.3242
H  5.078444 -1.68125 -1.435863
H  -2.944536 1.978111 1.196382
H  -3.003612 2.187503 -0.585519
H  1.009865 0.264773 -0.043493
H  -2.230148 -1.263062 0.048107
H  -3.938546 -3.134724 -0.102176
H  2.76177 4.232479 0.430303
H  -6.403702 -3.812168 -0.191973
H  -7.643715 1.064134 0.08823
H  -1.566582 3.723621 0.489849
H  0.44129 5.19663 0.627304
H  -8.813252 -3.128806 -0.198125
H  -9.440881 -0.701739 -0.059682
H  9.761401 -2.259146 -1.663263
