program: Gaussian 09
title: 000130027
version: EM64L-G09RevD.01
frameworkgroup: C1[X(C15H23O12P)]
method: RPBEPBE
basis: SDD
operation: Freq
keyword: #p
keyword: freq=noraman
keyword: PBEPBE/SDD
title: #p freq=noraman PBEPBE/SDD
converged: YES YES NO NO
title: Mulliken charges:
elementType: P O O O O O O O O O O O O C C C C C C C C C C C C C C C H H H H H H H H H H H H H H H H H H H H H H H
charge: 1.392530 -0.261577 -0.451924 -0.431005 -0.271209 -0.428557 -0.550026 -0.563723 -0.658590 -0.581147 -0.497073 -0.456156 -0.440557 -0.100810 -0.290964 0.040625 -0.092512 -0.014198 -0.311733 0.290771 -0.290844 -0.348123 -0.287005 -0.041895 -0.384195 -0.335193 0.258733 -0.322047 0.204636 0.273754 0.230155 0.215962 0.213005 0.223838 0.274028 0.364638 0.340630 0.358239 0.266733 0.255164 0.292191 0.233877 0.266716 0.240647 0.251246 0.397015 0.215224 0.195190 0.366797 0.398766 0.349953
chargesum: 0.00000
title: Mulliken charges with hydrogens summed into heavy atoms:
elementType: P O O O O O O O O O O O O C C C C C C C C C C C C C C C
charge: 1.392530 -0.261577 -0.087285 -0.090376 -0.271209 -0.070318 -0.550026 -0.563723 -0.261574 -0.581147 -0.130276 -0.057390 -0.090604 0.103825 -0.017209 0.270781 0.123449 0.198807 0.186132 0.290771 -0.024111 -0.092959 0.239063 0.224822 -0.143548 -0.083947 0.258733 0.088366
polarizability: 2.80966266e+02 -5.99740872e+00 2.28203828e+02 -1.98579729e+00 -1.83607043e+01 1.70903789e+02
1716.lowfreq: -1.3816 -0.0012 -0.0009 0.0005 4.5186 5.1930 24.8765 29.4005 40.9044
frequency: 24.8227 29.3851 40.8995 42.3219 51.2050 58.8698 69.2557 78.7663 82.2326 95.1425 98.1618 106.3166 112.2957 130.3958 135.8067 159.5214 177.8287 190.8229 199.6847 201.3777 215.9202 227.4087 230.8243 249.0708 264.4162 283.7220 286.0806 297.8976 336.3949 340.0519 354.1994 360.4130 366.1219 376.2848 380.5201 394.5718 397.4497 413.4960 417.1859 426.3123 440.6763 443.7494 460.0049 465.3097 475.7244 494.2259 519.2911 545.4425 569.8229 592.2826 597.8184 601.7543 635.5666 663.2646 719.5436 722.3829 739.5451 742.0592 799.1296 815.2215 823.8794 837.6330 855.2567 868.8838 893.6934 913.0517 913.3336 923.8301 940.1429 954.8813 959.8088 974.6212 978.7778 997.2820 997.9663 1000.8150 1012.1125 1030.4245 1035.8816 1050.9868 1063.7423 1064.5841 1077.3813 1088.6154 1093.7446 1097.5296 1099.7743 1133.3827 1152.2012 1163.0583 1170.3747 1182.5747 1192.4628 1204.3570 1218.1877 1226.5370 1238.8732 1239.5196 1246.2285 1263.2002 1263.9784 1267.8201 1279.1052 1308.0282 1310.4478 1311.7342 1322.7934 1336.9831 1341.3035 1359.3969 1371.5328 1379.1934 1384.6856 1390.9481 1398.7721 1402.4826 1413.5550 1429.7623 1456.3759 1461.4754 1468.6044 1492.9154 1591.5927 1618.7877 2931.6822 2933.5327 2945.5632 2956.7054 2966.7947 3008.4151 3014.8580 3024.0156 3050.2991 3063.1860 3100.4439 3101.4941 3147.1593 3149.5236 3162.0648 3172.4445 3191.3510 3521.3781 3534.5795 3536.7047 3563.6059 3575.5035 3584.3911
redmass: 6.4589 7.1882 6.3836 7.2231 6.4087 7.7215 5.6187 5.3912 4.9771 7.7241 6.6203 3.8727 4.5954 5.8742 5.6575 5.6583 4.6039 4.7013 1.5045 3.0838 3.9291 4.8541 4.5882 4.7358 4.7183 3.3272 4.8125 5.2823 1.9880 1.3524 4.5971 2.3778 3.6633 3.2393 3.4964 1.8314 3.8292 3.6804 1.2728 3.8054 3.8825 3.7022 3.6501 3.1394 1.8213 2.7515 2.8850 4.0435 5.4461 4.0309 3.9323 3.6562 6.8611 6.8046 4.2497 8.8174 5.2325 6.4607 1.5018 1.6804 3.8642 1.8711 2.9439 1.5463 2.8348 2.6057 4.6839 4.4972 1.4092 1.4208 5.3422 7.0914 2.3365 2.7361 1.4800 5.8107 3.6553 5.1999 2.5045 2.6765 2.1488 3.7645 2.6978 4.4557 1.2925 1.6422 3.4527 2.2453 1.6916 1.1777 1.5279 1.3369 1.3526 1.0781 2.2705 1.1458 1.2372 1.1661 1.1436 1.2266 1.6455 1.6350 1.2262 1.3781 1.7013 1.2586 1.3436 1.3043 1.3021 1.2467 1.3853 1.2272 1.5768 1.2450 3.4318 1.7621 1.4905 2.2244 1.0790 1.0828 1.0809 2.6258 6.4472 6.0635 1.0820 1.0829 1.0588 1.0839 1.0839 1.1020 1.0585 1.0577 1.0850 1.0860 1.1068 1.1097 1.0886 1.0885 1.0705 1.0966 1.0953 1.0656 1.0657 1.0656 1.0655 1.0661 1.0668
irintensity: 1.0559 0.9113 0.8933 0.9387 0.4503 2.3329 1.9217 5.6466 6.4019 0.9852 0.5565 4.0969 5.1443 11.5885 6.1595 5.7915 11.9812 14.4732 84.0366 31.6286 51.6133 20.5386 10.7389 2.3662 0.9845 7.8950 42.3836 1.2652 20.2215 5.2484 20.0224 129.7563 14.9289 17.1383 4.8705 111.8047 42.4022 1.7309 157.1456 7.5569 16.2907 10.8817 11.1392 88.9119 148.0730 86.7035 11.3032 1.3143 6.2004 18.7838 13.1953 8.2943 2.2839 37.4117 13.6016 148.0803 3.6566 121.4656 25.5125 13.1886 15.6512 87.2247 36.2866 171.1019 83.9241 47.7084 306.3102 170.8465 12.1097 5.7740 92.1904 111.1002 48.5846 9.1020 17.7001 101.9521 50.8942 92.7168 27.8224 9.4525 77.8152 60.5323 112.1247 212.8097 11.3630 19.0309 13.6350 24.8152 32.1743 102.5652 91.9558 26.6352 15.6645 12.6031 117.9707 8.8113 36.7535 33.5004 31.0999 0.8919 10.8044 10.4640 8.0931 6.5184 41.2762 27.4566 3.2952 5.8705 7.3573 2.2456 11.3648 31.8652 10.9117 41.2621 17.7704 7.6163 0.1665 65.1517 11.7330 9.7939 5.9123 123.2643 5.8745 22.7314 31.0743 0.5419 54.9131 42.7076 46.8438 29.9077 21.0346 17.1911 16.2424 9.6405 4.0662 7.1213 7.2625 14.2768 720.4112 7.7081 2.9338 13.9706 6.7187 20.1384 17.7675 64.7830 6.3746
temp: 298.150 k
press: 1.00000 atm
elementType: 15 8 8 8 8 8 8 8 8 8 8 8 8 6 6 6 6 6 6 6 6 6 6 6 6 6 6 6 1 1 1 1 1 1 1 1 1 1 1 1 1 1 1 1 1 1 1 1 1 1 1
symmnumber: 1
zpe: 1013977.7 jmol-1
zpe.correction: 0.386204 hartree
zpe.thermalcorrener: 0.416405 hartree
zpe.thermalcorrenthalpy: 0.417349 hartree
zpe.thermalcorrgfe: 0.324863 hartree
zpe.sumelectzpe: -1827.035127 hartree
zpe.sumelectthermal: -1827.004926 hartree
zpe.sumelectthermalent: -1827.003981 hartree
zpe.sumelectthermalfe: -1827.096468 hartree
dipole: 3.1062 -4.6059 0.0805
dipole: 5.5560
quadrupole: -145.7363 -206.3377 -161.2554
quadrupole: 6.6841 6.3197 -5.6239
quadrupole: 25.3735 -35.2279 9.8544 6.6841 6.3197 -5.6239
hfenergy: -1827.4213303 hartree
pointgroup: C01 [X(C15H23O12P1)]
dipole: 1.2718227 -1.777694 -0.0194903 debye
polarizability: 281.2766592|-4.1538712|229.4018945|0.5982473|-15.9593159|169.3953292 unknown
InChI: InChI=1S/C15H23O12P/c16-5-9(18)6-24-28(22,23)25-7-11-12(19)13(20)14(21)15(27-11)26-10-3-1-8(17)2-4-10/h1-4,9,11-22H,5-7H2
charge 0 multiplicity 1
51 atoms
P  -1.387845 -2.729014 0.76454
O  1.869446 -0.143764 0.627565
O  3.982213 -2.616592 -1.146289
O  5.860853 -0.398209 -0.57801
O  1.993916 2.170737 1.005976
O  4.477385 2.229272 -0.571152
O  -0.088702 -2.18884 -0.210484
O  -2.68716 -1.931104 -0.011882
O  -1.117448 -1.844961 2.235257
O  -1.632767 -4.273569 1.00673
O  -4.414176 0.360533 0.235653
O  -3.561397 2.916255 0.353711
O  -6.041997 -0.343849 -2.149843
C  3.666508 -1.519246 -0.233847
C  4.390547 -0.226135 -0.659287
C  2.143277 -1.263223 -0.282178
C  3.948349 1.047087 0.102086
C  2.414436 1.140015 0.109993
C  1.323272 -2.455062 0.187492
C  0.574826 2.418807 0.931839
C  -0.312531 1.586371 1.643134
C  0.097541 3.478228 0.130446
C  -2.503842 -0.729124 -0.889141
C  -3.909819 -0.145064 -1.058953
C  -1.701263 1.774448 1.495971
C  -1.294409 3.660485 -0.022975
C  -2.199921 2.77728 0.619527
C  -4.892457 -1.132306 -1.702709
H  3.954949 -1.777949 0.811502
H  4.222248 -0.067246 -1.740769
H  1.854008 -1.011822 -1.326166
H  4.289039 0.994061 1.160824
H  2.019441 1.305511 -0.918952
H  1.39719 -2.558034 1.286096
H  1.661943 -3.374399 -0.317822
H  4.95909 -2.596731 -1.323353
H  6.118456 -0.506554 0.375858
H  5.444203 2.076757 -0.738334
H  0.078537 0.778043 2.264696
H  0.811112 4.132704 -0.38102
H  -1.832696 -0.005277 -0.397754
H  -2.073745 -1.055611 -1.85189
H  -3.847657 0.75286 -1.699456
H  -2.395799 1.125038 2.039075
H  -1.696563 4.452704 -0.661516
H  -1.366336 -2.36397 3.043881
H  -5.17506 -1.916661 -0.97103
H  -4.389592 -1.625659 -2.562947
H  -4.389879 -0.381119 0.891865
H  -4.037653 2.033544 0.493489
H  -6.788872 -0.944947 -2.392847
