program: Gaussian 09
title: 000129896
version: EM64L-G09RevD.01
frameworkgroup: C1[X(C8H15NO2)]
method: RPBEPBE
basis: SDD
operation: Freq
keyword: #p
keyword: freq=noraman
keyword: PBEPBE/SDD
title: #p freq=noraman PBEPBE/SDD
converged: YES YES NO NO
title: Mulliken charges:
elementType: O O N C C C C C C C C H H H H H H H H H H H H H H H
charge: -0.194365 -0.274957 -0.359134 -0.354566 -0.358430 -0.371305 -0.382683 -0.449291 -0.066359 0.244547 -0.771107 0.199406 0.184288 0.185057 0.223646 0.215578 0.220331 0.253174 0.213493 0.230908 0.234835 0.291759 0.170483 0.253282 0.253938 0.207473
chargesum: 0.00000
title: Mulliken charges with hydrogens summed into heavy atoms:
elementType: O O N C C C C C C C C
charge: -0.194365 -0.274957 -0.067375 0.029128 0.050273 0.064603 0.083983 0.016453 0.104123 0.244547 -0.056413
polarizability: 1.25598832e+02 4.82986328e+00 8.90521251e+01 4.12850800e+00 -3.30626849e+00 8.29378833e+01
1716.lowfreq: -25.0456 -7.8372 -2.9622 -0.0009 -0.0008 -0.0005 14.9280 31.7059 43.5042
frequency: 13.5401 31.6202 41.9001 52.7153 81.9134 94.8361 115.2869 121.0801 167.7675 185.9753 267.5305 278.6243 348.1371 416.4575 479.4910 552.1984 601.8250 611.7539 658.9731 682.5240 730.5160 766.2110 841.2224 888.3998 900.2554 967.6770 974.3663 1018.5691 1037.9396 1041.8277 1076.6686 1094.7377 1100.6985 1121.0183 1162.6257 1224.1787 1229.6515 1253.6603 1277.2555 1287.0309 1289.1668 1301.4471 1340.3265 1360.0115 1368.2099 1378.7632 1386.2511 1423.9302 1450.0065 1454.1934 1462.9771 1467.1123 1469.4605 1482.4080 1492.7236 1622.0238 1645.1759 2850.4526 2945.8563 2952.2389 2968.2833 2982.0128 2984.1672 2991.8813 2994.6477 2998.7436 3034.7311 3054.6497 3069.9748 3096.3811 3099.2826 3555.5279
redmass: 5.6221 3.6811 2.3768 3.9058 1.2026 2.1916 2.3302 2.7425 1.7408 4.9723 4.0551 2.8007 3.7230 3.2310 2.6300 1.5238 2.5929 3.0536 1.1569 4.7228 1.0924 1.2774 1.6954 2.8501 1.8763 1.4724 1.6837 3.3188 2.4981 1.9287 2.2980 3.3811 3.1641 1.7780 1.5192 1.3493 1.3203 1.9057 1.1563 1.2661 1.2010 1.1228 1.4965 1.6248 1.3676 1.2395 1.2318 1.1038 1.0459 1.1057 1.0677 1.1020 1.0862 1.1327 1.7663 6.2609 7.5116 1.0839 1.0620 1.0594 1.0630 1.0661 1.0952 1.0622 1.0362 1.0947 1.0983 1.1028 1.1010 1.1005 1.0980 1.0777
irintensity: 7.6953 9.8236 0.1223 8.7099 1.0246 0.9225 0.5821 0.8250 1.5755 6.4389 7.1408 6.5954 3.6796 2.3608 13.2646 103.4037 9.6403 1.4988 11.4397 7.3710 7.6906 2.6068 1.5406 13.5653 3.8470 1.3467 5.4537 2.6804 5.9480 7.4299 0.8502 5.5686 2.6713 0.9900 13.2565 9.4899 7.3923 114.5378 17.6799 3.6792 5.2868 19.3317 16.1606 1.8155 3.6224 6.8272 54.2876 32.1103 16.4267 29.3319 0.8899 31.5325 6.9485 28.2941 160.8366 187.9387 117.1594 163.1524 30.8187 28.0483 25.9117 52.2642 9.3095 26.1005 14.0862 14.9423 13.6425 60.8229 31.0295 24.1872 9.2679 12.3172
temp: 298.150 k
press: 1.00000 atm
elementType: 8 8 7 6 6 6 6 6 6 6 6 1 1 1 1 1 1 1 1 1 1 1 1 1 1 1
symmnumber: 1
zpe: 578823.2 jmol-1
zpe.correction: 0.220462 hartree
zpe.thermalcorrener: 0.234285 hartree
zpe.thermalcorrenthalpy: 0.235229 hartree
zpe.thermalcorrgfe: 0.176184 hartree
zpe.sumelectzpe: -518.162930 hartree
zpe.sumelectthermal: -518.149107 hartree
zpe.sumelectthermalent: -518.148163 hartree
zpe.sumelectthermalfe: -518.207208 hartree
dipole: 0.1841 -1.0930 -3.6041
dipole: 3.7707
quadrupole: -74.3811 -70.4368 -68.3912
quadrupole: 22.7380 -11.0213 0.5389
quadrupole: -3.3114 0.6329 2.6785 22.7380 -11.0213 0.5389
hfenergy: -518.3833919 hartree
pointgroup: C01 [X(C8H15N1O2)]
dipole: -0.0637149 1.1631947 -0.9185329 debye
dipolederiv: -0.565009 0.0794931 0.0163121 0.1999866 -0.6510577 -0.2276884 0.0971623 -0.2443976 -0.4520324 -0.6200913 -0.092842 -0.0650505 -0.1449904 -0.4307574 0.0277923 0.2541958 0.1353291 -1.0292465 -1.1223747 -0.1721442 0.2702327 -0.2357439 -0.5976497 0.2035442 0.2888989 0.1231137 -0.4583572 -0.0326422 0.0152746 -0.0140043 0.0603246 0.1476571 -0.0540425 -0.0034331 -0.0387064 0.144025 -0.0970371 -0.0038667 -0.0247059 0.0259198 0.0177495 -0.0068407 -0.0385951 -0.0560905 0.1883696 -0.0015437 0.0083098 -0.0134177 -0.0382737 0.0644657 -0.0431678 -0.0454298 -0.0523856 0.1175244 0.5111085 0.0559665 0.0084504 0.0507234 0.347386 -0.058581 0.2015237 0.0708134 0.067956 -0.3488617 0.2016274 0.0592815 0.34378 -0.0955037 -0.14526 0.1430882 -0.1523253 0.0829381 0.9795713 -0.2008089 0.0077967 -0.2397396 0.7002712 0.4251894 -0.0099319 0.4237319 0.3625356 1.1840035 0.474922 -0.1705975 0.5805858 0.4459662 -0.2064934 -0.4941501 -0.2627523 1.2851597 -0.3267429 -0.1519865 -0.1417467 -0.1782635 -0.0530626 -0.0736741 -0.1182674 -0.0620649 -0.013048 0.0405229 0.0034361 0.0196775 0.0013233 0.0579386 -0.0230027 0.0119063 -0.0474093 -0.1729645 0.0339989 -0.0289316 0.0024796 -0.030818 -0.1749584 0.0644151 0.0094624 0.0897181 0.0379721 0.0322924 0.0143994 0.017715 0.0073772 0.0581611 -0.0215815 0.0121015 -0.0501061 -0.1867282 0.0471994 -0.0179909 0.0024257 -0.0205761 -0.1226761 0.0504146 0.006068 0.073787 0.0426566 0.0527082 0.0044681 0.0075621 -0.0083677 0.0714911 -0.0151833 0.0147354 -0.0214384 -0.1446326 0.0483017 -0.0355943 0.0093108 -0.0293037 -0.1157938 0.059491 -0.0019677 0.0676048 0.0491723 0.0968966 0.0206949 0.0196236 0.0297343 0.0974039 0.0032287 -0.0489299 -0.066597 -0.0342925 -0.0321972 -0.0596858 0.0113522 -0.0470605 -0.1566878 0.0720499 -0.0100203 0.1006722 0.0657224 0.0406629 -0.0141377 0.0168657 -0.0894841 -0.0865425 0.0451328 -0.0125239 0.0867664 0.0948694 0.0490811 0.026005 0.0138986 -0.0377741 0.1194747 0.0001911 -0.0479418 -0.0214781 -0.1156876 0.182276 -0.0825807 -0.0004561 -0.118312 0.2775509 -0.0173777 -0.0529282 -0.0105632 0.0790087 -0.2891533 -0.0743789 -0.113897 -0.1077551 -0.0196839 -0.0990432 -0.1438269 -0.0938097 0.0014589 0.1107743 0.0065485 -0.012009 -0.0461595 -0.0802768 0.0269476 -0.0277647 0.0522935 0.0845982 -0.0408496 0.0551569 0.0341621 0.097038 0.0836179 -0.0328705 0.0541659 -0.0539648 0.0695669 0.067105 -0.0313542 0.0387387 -0.0241712 0.0955164 0.04641 -0.0375978 0.010259 -0.1665444 unknown
polarizability: 125.6592517|6.1187999|83.9009439|-0.4704351|4.0414681|88.0286447 unknown
InChI: InChI=1S/C8H15NO2/c1-8(11)9-6-4-2-3-5-7-10/h7,9H,2-6H2,1H3
charge 0 multiplicity 1
26 atoms
O  4.928649 -1.178365 -0.555238
O  -3.566732 -0.19839 1.409425
N  -2.745416 0.468687 -0.665449
C  1.030076 0.815335 0.172825
C  -0.252684 0.193512 -0.422922
C  2.294215 -0.014346 -0.140425
C  -1.504946 1.051694 -0.129538
C  3.565824 0.591833 0.480045
C  4.849647 -0.155968 0.167196
C  -3.694325 -0.136611 0.148179
C  -4.907232 -0.717698 -0.576017
H  0.909914 0.912039 1.271979
H  1.157789 1.846655 -0.219898
H  -0.128248 0.071681 -1.519167
H  -0.40973 -0.818901 -0.003315
H  2.429763 -0.100588 -1.235824
H  2.166947 -1.049837 0.229578
H  -1.653547 1.141095 0.961315
H  -1.370068 2.071155 -0.543199
H  3.711296 1.644065 0.147868
H  3.481094 0.656744 1.587197
H  -2.886603 0.465655 -1.676545
H  5.770707 0.278818 0.639107
H  -4.984562 -1.793197 -0.341166
H  -5.821239 -0.23365 -0.190867
H  -4.872189 -0.592714 -1.672544
