program: Gaussian 09
title: 000129890
version: EM64L-G09RevD.01
frameworkgroup: C1[X(C10H13N5O3)]
method: RPBEPBE
basis: SDD
operation: Freq
keyword: #p
keyword: freq=noraman
keyword: PBEPBE/SDD
title: #p freq=noraman PBEPBE/SDD
converged: YES YES NO NO
title: Mulliken charges:
elementType: O O O N N N N N C C C C C C C C C C H H H H H H H H H H H H H
charge: -0.251376 -0.364792 -0.310689 -0.381620 -0.393503 -0.062610 -0.116366 -0.096925 -0.400358 -0.033759 -0.414347 -0.377503 -0.308778 0.232300 0.089961 0.105300 0.068695 -0.214618 0.190638 0.226410 0.265400 0.224104 0.206680 0.204137 0.208812 0.192631 0.224140 0.299242 0.325014 0.280051 0.383729
chargesum: 0.00000
title: Mulliken charges with hydrogens summed into heavy atoms:
elementType: O O O N N N N N C C C C C C C C C C
charge: -0.251376 0.018938 -0.310689 -0.082378 -0.068489 -0.062610 -0.116366 -0.096925 0.016691 0.231641 0.016438 0.035445 0.107993 0.232300 0.089961 0.105300 0.068695 0.065433
polarizability: 2.30596679e+02 1.89078030e+00 1.53771827e+02 3.09042492e+00 -1.26390099e+00 9.09036362e+01
1716.lowfreq: -0.0009 -0.0007 -0.0002 4.0916 5.1954 9.9346 23.2320 39.9452 60.2272
frequency: 22.8026 39.8477 60.2197 95.8877 134.4520 149.7147 200.5653 202.6049 211.3360 223.8957 236.4586 311.4995 312.6829 349.6164 405.8180 422.4961 453.5161 457.0206 487.8757 500.1470 520.6944 560.8460 578.7640 583.0745 648.8679 657.4778 660.0045 688.8956 703.1356 709.4752 750.4391 769.3548 789.8133 808.5615 834.8200 856.8846 865.0795 927.2379 961.7498 978.7657 998.1732 1042.9398 1060.6572 1090.1256 1107.7777 1128.2115 1150.3060 1162.8550 1170.4052 1188.9553 1233.8475 1245.7391 1250.4024 1254.4674 1262.3515 1298.6390 1318.5484 1333.4583 1338.8260 1343.9219 1356.7432 1360.6169 1363.7214 1415.3739 1445.9270 1455.1353 1460.2656 1472.5704 1485.1808 1503.5216 1523.4588 1557.2199 1593.4656 1641.1525 2932.0644 2948.0620 2977.5514 2979.4902 2989.2971 3015.0409 3045.1780 3051.4909 3059.5264 3081.0126 3274.2871 3538.0534 3547.1528
redmass: 3.9740 5.4957 4.4951 7.5857 8.3407 4.0389 6.2551 6.1823 8.7214 2.9888 3.4917 2.0026 1.5743 6.5728 6.2391 2.7508 3.7008 3.8809 2.7085 4.7716 5.3267 2.3463 1.3017 4.0802 4.6391 6.7650 6.4052 8.3878 1.2554 6.8521 3.5421 1.8817 2.5344 5.2977 2.1638 2.5483 1.8826 2.4151 3.6169 2.1777 2.9705 2.4941 5.1355 2.0663 3.0624 2.2696 1.8664 1.5974 3.8098 1.4565 1.6743 3.2417 3.6763 1.2866 1.5636 1.3612 1.6399 1.5451 1.4301 1.4134 1.5147 1.9980 1.8083 5.6331 1.0967 1.0894 1.0870 1.0936 4.0316 3.6454 2.3238 2.4058 4.9639 3.6993 1.0720 1.0685 1.0657 1.0612 1.0612 1.0846 1.0975 1.1002 1.1025 1.0975 1.0996 1.0785 1.0766
irintensity: 0.5223 2.7166 1.8879 0.0488 0.0362 6.6407 30.4392 6.9422 3.4937 8.0602 0.1039 1.3665 13.8011 11.3359 3.6189 3.9162 14.4920 4.4517 5.3634 6.4929 5.1485 8.1686 193.2149 2.7925 17.2664 7.4436 1.7740 23.9127 110.1973 23.2403 0.1054 47.5065 17.8123 4.4768 2.3598 17.9075 41.2446 21.8989 43.2276 28.9515 156.8166 14.4959 31.4876 23.7284 19.8048 4.1790 9.5966 68.2944 61.1978 26.8408 109.3089 7.1740 103.0818 8.7203 38.0342 37.2570 24.2911 15.1795 1.8007 1.9297 43.4462 76.4566 33.7059 125.3503 5.5749 16.0084 9.6061 10.8863 418.7808 276.5562 60.4341 239.5195 546.1657 140.3875 225.4274 52.5036 18.6934 35.2871 36.7663 8.2848 40.5321 33.2290 59.0525 40.1050 5.5176 35.3537 61.2196
temp: 298.150 k
press: 1.00000 atm
elementType: 8 8 8 7 7 7 7 7 6 6 6 6 6 6 6 6 6 6 1 1 1 1 1 1 1 1 1 1 1 1 1
symmnumber: 1
zpe: 629149.4 jmol-1
zpe.correction: 0.239630 hartree
zpe.thermalcorrener: 0.255090 hartree
zpe.thermalcorrenthalpy: 0.256035 hartree
zpe.thermalcorrgfe: 0.195840 hartree
zpe.sumelectzpe: -886.908774 hartree
zpe.sumelectthermal: -886.893314 hartree
zpe.sumelectthermalent: -886.892370 hartree
zpe.sumelectthermalfe: -886.952564 hartree
dipole: -4.7053 -3.9747 -0.9022
dipole: 6.2251
quadrupole: -93.1884 -109.8495 -106.8429
quadrupole: -3.0593 2.4872 2.9084
quadrupole: 10.1052 -6.5559 -3.5493 -3.0593 2.4872 2.9084
hfenergy: -887.1484042 hartree
pointgroup: C01 [X(C10H13N5O3)]
dipole: 1.8472157 -1.5896389 -0.2432902 debye
polarizability: 230.6288213|-2.6360921|145.1148376|0.5590333|21.7383214|99.5284828 unknown
InChI: InChI=1S/C10H13N5O3/c16-9-7-8(11-5-15(7)17)13-10(14-9)12-6-3-1-2-4-18-6/h5-6,12-13,17H,1-4H2
charge 0 multiplicity 1
31 atoms
O  3.062546 0.028776 -1.274599
O  -4.542889 1.423492 0.547253
O  -1.84127 2.194168 1.039689
N  1.358072 -1.111147 -0.141178
N  -0.927554 -1.545559 -0.544817
N  -0.190972 0.563695 0.444242
N  -3.882361 0.255959 0.072284
N  -3.429836 -1.786769 -0.803244
C  3.578877 -0.902288 0.967027
C  2.506915 -0.249128 0.074372
C  4.818425 0.02172 1.067803
C  5.344321 0.387433 -0.340833
C  4.203478 0.968008 -1.196266
C  0.054912 -0.649937 -0.076221
C  -2.260047 -1.142672 -0.444162
C  -2.502597 0.120445 0.099797
C  -1.502489 1.044889 0.562862
C  -4.422442 -0.890919 -0.469551
H  3.874312 -1.876731 0.527022
H  3.148343 -1.096764 1.966823
H  2.12837 0.689863 0.52289
H  5.609454 -0.467178 1.665166
H  4.53646 0.94946 1.60654
H  6.166708 1.125344 -0.270854
H  5.747173 -0.516146 -0.837829
H  3.852416 1.933761 -0.77034
H  4.506422 1.12926 -2.243758
H  1.550008 -2.013719 -0.579992
H  -0.693125 -2.448051 -0.963394
H  -5.486897 -1.048403 -0.607439
H  -3.747232 2.007137 0.845905
