program: Gaussian 09
title: 000129911
version: EM64L-G09RevD.01
frameworkgroup: C1[X(C19H19N)]
method: RPBEPBE
basis: SDD
operation: Freq
keyword: #pfreq=noraman
keyword: PBEPBE/SDD
title: #p freq=noraman PBEPBE/SDD
converged: YES YES NO NO
title: Mulliken charges:
elementType: N C C C C C C C C C C C C C C C C C C C H H H H H H H H H H H H H H H H H H H
charge: -0.588946 -0.185928 -0.650950 0.448394 -0.472804 0.524563 0.143190 0.404831 -0.446839 -0.449657 -0.399785 -0.414613 -0.469917 -0.245639 -0.441368 -0.225213 -0.248983 -0.276711 -0.246442 -0.246277 0.230026 0.251705 0.227161 0.221477 0.210158 0.237607 0.234727 0.223564 0.289691 0.235736 0.222915 0.281129 0.268500 0.234506 0.224626 0.222075 0.222165 0.224682 0.226645
chargesum: 0.00000
title: Mulliken charges with hydrogens summed into heavy atoms:
elementType: N C C C C C C C C C C C C C C C C C C C
charge: -0.039316 0.044098 -0.172084 0.448394 -0.041170 0.524563 0.143190 0.404831 -0.209232 -0.214930 -0.176222 -0.124922 -0.234181 -0.022724 -0.206863 -0.000587 -0.026908 -0.054545 -0.021761 -0.019632
chargesum: -0.00002
polarizability: 2.55173232e+02 -2.49090840e+01 2.21536528e+02 -4.00254407e+01 -6.39116074e-01 1.45214230e+02
1716.lowfreq: -8.0287 -0.2695 -0.0012 0.0004 3.2665 11.5728 25.9761 29.0266 38.3294
frequency: 25.0159 28.8664 38.2544 67.7969 95.1921 104.9615 152.8191 161.4428 178.6063 224.6930 235.8869 241.2060 315.3334 336.4821 360.9316 402.9620 419.8298 436.7761 442.1044 472.6947 501.8965 511.8562 534.7190 566.3182 597.3729 604.6088 617.5909 643.2156 655.8170 705.9552 707.1739 748.2137 768.7933 774.9543 787.8018 792.6678 820.6570 850.5947 853.4178 882.2327 889.0870 915.8955 917.9741 938.3852 966.3334 974.7300 975.3190 984.8302 990.5315 993.7491 1002.8105 1019.8229 1028.2596 1040.7135 1055.6152 1075.8867 1078.1265 1092.7469 1143.8570 1149.7731 1169.3694 1171.8219 1175.5863 1182.8450 1188.6705 1210.8836 1236.8861 1252.1527 1274.1546 1282.0869 1297.2872 1312.7121 1326.3642 1338.2719 1370.9463 1380.6332 1385.4605 1406.0187 1419.0699 1442.5375 1445.1360 1455.1038 1474.0429 1482.7322 1491.0076 1519.5308 1589.2263 1592.3058 1598.2785 1613.6354 1632.2001 1642.0002 2918.5278 2980.1867 2992.5082 3025.3336 3049.9532 3111.2252 3113.9843 3116.7722 3117.4057 3120.0712 3127.4972 3130.0520 3135.2530 3141.4730 3152.6762 3155.5490 3160.3393 3457.6697 3582.7713
redmass: 4.9737 3.9157 4.7741 4.1081 4.0234 2.7216 4.0009 4.1358 3.8962 2.1118 1.5091 3.4198 3.5433 3.1965 3.8446 2.8174 3.5209 3.0236 2.8121 3.2427 5.5578 4.8627 3.1064 3.5266 3.3446 4.4686 6.0978 1.5384 3.1165 1.8841 3.0313 1.2724 2.0504 3.0218 5.1118 1.8058 1.9046 2.2211 1.3013 2.5944 1.6666 1.4559 1.4427 2.0087 1.5038 1.4374 1.7245 1.3912 4.8760 1.3760 1.3198 3.2230 2.1871 2.2758 3.1981 1.6113 2.4086 2.6239 1.5161 1.4194 1.3016 1.0726 1.1481 1.2183 1.1150 1.7552 1.8200 1.7807 1.3632 1.5595 1.5475 1.3402 1.2547 1.3642 1.4201 2.1478 4.9660 2.9030 5.2538 2.1498 2.3256 2.4870 1.0899 2.1224 1.2520 3.0220 7.4565 5.9530 5.2433 6.1618 6.2964 1.0946 1.0682 1.0804 1.0627 1.0934 1.1023 1.0862 1.0857 1.0869 1.0859 1.0890 1.0918 1.0910 1.0950 1.0958 1.0993 1.1001 1.1014 1.0454 1.0975
irintensity: 0.1213 0.0719 0.1240 1.4041 1.3900 0.4553 0.2996 1.2282 4.6990 11.7481 23.3063 7.0128 4.4388 1.9891 3.2449 0.0507 2.8674 5.0776 11.2099 0.5403 0.5666 2.7271 18.7842 2.7503 40.2815 1.3324 2.5705 157.5722 27.1046 58.7028 6.8537 2.9035 25.0635 20.0801 1.0125 76.1656 54.5643 0.3960 0.0719 1.0778 0.4736 0.8387 1.2498 4.0014 5.7106 0.4088 1.7095 5.5849 0.6808 0.4445 1.5815 18.2258 1.2999 1.1577 1.5491 6.8767 18.7056 8.8723 14.5476 6.5096 1.6232 0.2651 3.6362 0.2427 0.5941 1.4836 2.7907 2.7941 9.8611 4.4702 3.6071 1.6052 0.8478 0.8002 4.6707 10.1098 1.0389 4.2168 6.3217 7.4568 6.0072 1.0296 3.5827 12.9728 12.6003 8.8508 4.3268 1.2499 7.7424 8.5789 0.5161 42.1335 93.7593 2.9458 22.4047 37.2699 19.1141 10.1290 1.4526 4.6993 2.2782 9.5196 24.3187 12.8530 15.3651 44.1720 46.2318 37.0241 25.7520 0.3074 1.8146
temp: 298.150 k
press: 1.00000 atm
elementType: 7 6 6 6 6 6 6 6 6 6 6 6 6 6 6 6 6 6 6 6 1 1 1 1 1 1 1 1 1 1 1 1 1 1 1 1 1 1 1
symmnumber: 1
zpe: 854434.9 jmol-1
zpe.correction: 0.325437 hartree
zpe.thermalcorrener: 0.342559 hartree
zpe.thermalcorrenthalpy: 0.343503 hartree
zpe.thermalcorrgfe: 0.279135 hartree
zpe.sumelectzpe: -788.771343 hartree
zpe.sumelectthermal: -788.754221 hartree
zpe.sumelectthermalent: -788.753277 hartree
zpe.sumelectthermalfe: -788.817645 hartree
dipole: 1.2645 1.6758 0.5613
dipole: 2.1731
quadrupole: -113.0776 -101.2958 -117.7505
quadrupole: 0.6889 -8.2341 -0.5007
quadrupole: -2.3696 9.4121 -7.0425 0.6889 -8.2341 -0.5007
hfenergy: -789.0967802 hartree
pointgroup: C01 [X(C19H19N1)]
dipole: -0.5286396 -0.5991861 0.3040928 debye
polarizability: 254.9364945|-23.140186|223.7840884|38.1438447|-9.0775933|143.2034067 unknown
InChI: InChI=1S/C19H19N/c20-14-18(15-7-2-1-3-8-15)13-17-11-6-10-16-9-4-5-12-19(16)17/h1-12,18H,13-14,20H2
charge 0 multiplicity 1
39 atoms
N  -0.775232 -3.679648 0.236548
C  -1.257083 -1.230111 0.152516
C  -0.424937 -0.984224 -1.155642
C  0.635016 0.093297 -1.003488
C  -1.851879 -2.669468 0.140055
C  -2.334808 -0.168076 0.354598
C  1.904688 -0.198833 -0.370054
C  2.882223 0.863391 -0.214214
C  0.386399 1.397691 -1.452468
C  -2.224533 0.790315 1.393123
C  -3.469153 -0.104536 -0.499307
C  2.24232 -1.511665 0.109871
C  2.5769 2.181516 -0.690006
C  1.349464 2.442436 -1.299059
C  4.141737 0.573791 0.40911
C  -3.21327 1.784021 1.578067
C  -4.46135 0.88361 -0.317933
C  3.479136 -1.761392 0.711367
C  4.43885 -0.711679 0.865461
C  -4.337647 1.833774 0.723224
H  -0.557413 -1.175969 1.011443
H  0.031009 -1.953901 -1.429053
H  -1.123589 -0.703697 -1.966159
H  -2.609482 -2.749696 0.95275
H  -2.387666 -2.8367 -0.813988
H  -0.57693 1.621816 -1.925817
H  -1.350416 0.762508 2.055318
H  -3.579082 -0.828775 -1.316709
H  1.519579 -2.328076 -0.005804
H  3.322691 2.976652 -0.569646
H  1.11568 3.448996 -1.663528
H  -1.010074 -4.59463 -0.158483
H  -0.375931 -3.764505 1.177154
H  4.872432 1.38469 0.518762
H  -3.104102 2.518037 2.384693
H  -5.329858 0.914341 -0.986221
H  3.721356 -2.770061 1.065616
H  5.404929 -0.921821 1.338168
H  -5.106275 2.602182 0.863936
