program: Gaussian 09
title: 000129904
version: EM64L-G09RevD.01
frameworkgroup: C1[X(C13H17NO8)]
method: RPBEPBE
basis: SDD
operation: Freq
keyword: #p
keyword: freq=noraman
keyword: PBEPBE/SDD
title: #p freq=noraman PBEPBE/SDD
converged: YES YES NO NO
title: Mulliken charges:
elementType: O O O O O O O O N C C C C C C C C C C C C C H H H H H H H H H H H H H H H H H
charge: -0.280804 -0.461905 -0.459028 -0.452235 -0.437730 -0.401097 -0.422498 -0.327926 -0.438589 -0.163807 -0.089162 -0.170224 -0.037475 -0.110518 -0.373367 0.478536 -0.436371 -0.406079 0.129153 -0.323008 0.118721 0.163224 0.232894 0.222291 0.224547 0.231425 0.225115 0.189618 0.251218 0.294993 0.370026 0.366116 0.356739 0.353894 0.300849 0.237706 0.260329 0.389136 0.395294
chargesum: 0.00000
title: Mulliken charges with hydrogens summed into heavy atoms:
elementType: O O O O O O O O N C C C C C C C C C C C C C
charge: -0.280804 -0.091879 -0.092912 -0.095496 -0.083836 -0.011960 -0.027205 -0.327926 -0.143596 0.069087 0.133128 0.054323 0.193950 0.114597 0.067469 0.478536 -0.135522 -0.168374 0.129153 -0.062679 0.118721 0.163224
polarizability: 2.44024490e+02 2.75269817e+00 1.88354259e+02 2.71073503e+00 -2.38969931e+01 1.16732108e+02
1716.lowfreq: -4.4258 -0.0005 0.0005 0.0008 2.5370 11.1272 20.9331 31.9057 36.2505
frequency: 20.1828 31.7496 36.1252 67.9659 85.1428 99.9466 104.5775 123.0648 144.7450 153.1160 176.4345 185.2603 210.8798 221.9771 239.6450 278.4440 283.0001 324.4733 345.9418 354.5596 373.9488 389.7292 407.7670 414.7916 420.2408 428.1328 430.3675 445.4428 454.2225 464.2164 480.3293 521.8512 530.8479 548.3634 561.1602 590.0707 594.3483 608.3949 619.4006 638.4305 688.6294 723.2197 755.9129 796.4021 814.9482 835.7844 846.2230 900.6063 913.2452 932.9865 950.7998 959.9617 969.2950 981.5233 1014.0001 1024.6577 1034.0232 1046.0290 1052.7710 1068.7833 1091.6013 1106.7588 1118.2343 1138.6977 1164.6991 1183.7474 1194.2836 1208.8363 1223.8713 1228.5399 1246.6498 1256.8587 1267.9430 1280.0664 1287.1489 1296.8875 1305.7251 1317.8728 1321.7422 1343.3890 1352.9188 1374.1337 1380.4797 1393.3101 1398.2803 1407.3579 1413.7991 1422.9001 1462.4722 1475.4542 1500.6829 1578.4951 1593.7268 1657.2697 2951.3265 2957.5177 2959.0091 2968.6302 2978.3048 2987.9926 3068.0904 3110.2106 3128.4694 3177.6530 3180.0526 3505.2914 3533.7848 3537.0305 3537.9396 3547.3398 3567.0282
redmass: 6.8181 7.1536 6.8302 7.0375 5.7660 6.0703 6.1156 7.1976 6.6577 4.7250 3.2359 5.8298 4.0858 4.2717 4.3326 4.7271 4.3754 4.4081 4.2847 3.0866 3.3452 2.8519 1.5663 2.6304 1.6906 8.2852 1.9633 1.2836 2.8943 1.7417 4.8883 4.5296 2.0850 2.3847 3.8378 2.9588 1.5026 4.2418 3.2603 4.3687 4.6581 5.1746 4.2117 5.1414 1.2390 1.3936 2.6932 1.6195 5.9000 4.7556 5.4177 1.3718 5.0669 3.6718 2.9351 3.6522 3.2757 2.9041 3.0060 2.4160 4.2280 2.1400 1.7382 1.5570 1.4262 1.5258 1.4655 1.2171 1.1813 1.4350 1.5305 1.6183 1.4152 1.2601 2.4438 1.2601 1.2986 1.3825 1.3129 1.2160 1.4474 1.6006 1.4659 1.4026 1.8511 5.6115 1.9864 5.3199 1.0820 2.0990 2.1456 6.3595 3.8274 5.9629 1.0817 1.0756 1.0796 1.0814 1.0840 1.0852 1.0679 1.0939 1.0902 1.0932 1.0938 1.0753 1.0642 1.0656 1.0654 1.0656 1.0658
irintensity: 0.7542 1.2779 0.3369 0.6763 3.4337 1.2994 1.4579 1.0646 1.4102 1.1830 2.8949 7.2389 12.6918 4.1922 14.2014 6.9848 6.4996 24.0559 14.7423 42.0665 13.6176 29.4504 75.2906 16.1220 48.7269 7.1585 104.3533 283.4671 28.5401 87.7557 15.1954 8.8441 75.3453 41.0098 56.5766 69.3143 95.9501 17.4146 17.5967 20.9143 5.0605 3.8216 1.2163 27.0669 204.4561 1.7441 45.0290 16.0275 210.5405 32.6315 62.3828 1.7784 117.9172 6.6100 39.2939 203.0708 14.7495 38.7947 190.5400 43.4382 24.1959 14.2559 106.0984 42.1777 43.2721 87.7830 44.6936 15.0508 21.7274 53.6886 107.5503 99.0627 4.8208 26.0819 39.7576 67.2118 24.0171 27.0656 52.5349 11.5065 0.4868 1.4085 23.7355 5.7695 20.2580 83.7012 121.2797 33.6941 5.3498 21.5627 404.8792 174.9701 101.1066 51.0645 5.9568 19.6577 10.5690 2.8074 6.4620 169.8338 231.9063 10.9980 9.4889 5.1543 5.0651 13.6403 70.9548 15.8560 10.4167 20.1459 23.6914
temp: 298.150 k
press: 1.00000 atm
elementType: 8 8 8 8 8 8 8 8 7 6 6 6 6 6 6 6 6 6 6 6 6 6 1 1 1 1 1 1 1 1 1 1 1 1 1 1 1 1 1
symmnumber: 1
zpe: 786003.9 jmol-1
zpe.correction: 0.299373 hartree
zpe.thermalcorrener: 0.320797 hartree
zpe.thermalcorrenthalpy: 0.321742 hartree
zpe.thermalcorrgfe: 0.248519 hartree
zpe.sumelectzpe: -1160.437568 hartree
zpe.sumelectthermal: -1160.416143 hartree
zpe.sumelectthermalent: -1160.415199 hartree
zpe.sumelectthermalfe: -1160.488422 hartree
dipole: -1.5523 -3.9152 0.0460
dipole: 4.2119
quadrupole: -149.7857 -127.7128 -125.6773
quadrupole: 8.0236 -0.9034 -9.9851
quadrupole: -15.3938 6.6792 8.7146 8.0236 -0.9034 -9.9851
hfenergy: -1160.7369409 hartree
pointgroup: C01 [X(C13H17N1O8)]
dipole: 0.5937914 1.5469177 -0.0203457 debye
polarizability: 243.8392939|3.6315684|189.3060824|-4.9453269|22.4273391|115.9654805 unknown
InChI: InChI=1S/C13H17NO8/c15-4-8-9(17)10(18)11(19)12(22-8)14-5-1-2-7(16)6(3-5)13(20)21/h1-3,8-12,14-20H,4H2
charge 0 multiplicity 1
39 atoms
O  1.487625 -0.426885 0.819942
O  4.911828 1.386056 -0.793534
O  4.791263 -1.474624 -0.56244
O  2.343049 2.66792 -1.171219
O  1.264351 -3.212069 1.225724
O  -5.377727 0.492266 0.232418
O  -2.582465 -2.366233 -1.244775
O  -4.798057 -1.786501 -0.89317
N  0.174666 1.567005 0.538861
C  3.62233 0.687063 -0.773778
C  3.830804 -0.575599 0.076027
C  2.506355 1.572635 -0.208074
C  2.499275 -1.335331 0.211409
C  1.201416 0.758431 -0.047915
C  2.566812 -2.549465 1.140172
C  -1.208266 1.22725 0.461317
C  -1.662507 0.021004 -0.102678
C  -2.170316 2.161182 0.954306
C  -3.056265 -0.246173 -0.20756
C  -3.544482 1.900096 0.882222
C  -4.014112 0.698508 0.292181
C  -3.559311 -1.491126 -0.791974
H  3.335568 0.389305 -1.806624
H  4.190908 -0.265504 1.081447
H  2.809406 1.96402 0.788911
H  2.147376 -1.656519 -0.792943
H  0.86625 0.399752 -1.04453
H  2.921074 -2.226546 2.142672
H  3.267554 -3.291915 0.729961
H  0.456234 2.086272 1.375818
H  4.804184 2.213909 -1.327717
H  5.593547 -0.935535 -0.787805
H  1.514116 3.163722 -0.942786
H  0.601894 -2.520374 1.486844
H  -0.964219 -0.746769 -0.443881
H  -1.826289 3.106667 1.391173
H  -4.280272 2.613573 1.262942
H  -5.54544 -0.412073 -0.204486
H  -3.013361 -3.186594 -1.606058
