program: Gaussian 09
title: 000129870
version: EM64L-G09RevD.01
frameworkgroup: C1[X(C11H15NO2)]
method: RPBEPBE
basis: SDD
operation: Freq
keyword: #p
keyword: freq=noraman
keyword: PBEPBE/SDD
title: #p freq=noraman PBEPBE/SDD
converged: YES YES NO NO
title: Mulliken charges:
elementType: O O N C C C C C C C C C C C H H H H H H H H H H H H H H H
charge: -0.271584 -0.267820 -0.617031 -0.032457 -0.605156 -0.359446 0.552400 -0.533912 -0.398694 0.193393 0.160985 -0.710976 -0.336484 -0.201825 0.198369 0.229495 0.197860 0.213416 0.205871 0.262238 0.234451 0.223229 0.203383 0.211697 0.269660 0.262225 0.247166 0.234567 0.234979
chargesum: 0.00000
title: Mulliken charges with hydrogens summed into heavy atoms:
elementType: O O N C C C C C C C C C C C
charge: -0.271584 -0.267820 -0.085146 0.165913 -0.177800 0.059841 0.552400 -0.271674 -0.164244 0.193393 0.160985 -0.072666 -0.089318 0.267722
polarizability: 1.78178676e+02 1.52629472e+01 1.15544525e+02 9.95835517e+00 -1.12432346e+01 9.93655942e+01
1716.lowfreq: -65.9289 -7.5444 -0.0009 -0.0008 -0.0008 4.5458 11.5903 29.4047 48.9970
frequency: -65.9116 29.3862 48.9799 66.2088 104.7587 165.5072 210.1735 218.2493 231.4096 256.4225 285.1518 308.9748 324.5198 411.6369 419.1401 439.6632 470.5763 524.5179 583.8132 594.0597 632.9127 678.6835 717.3631 753.8906 767.5878 776.6925 804.2094 822.2864 842.0898 875.6996 904.4041 928.7529 935.0934 968.1760 978.8876 1007.9961 1052.9672 1056.9891 1064.4292 1072.2156 1118.9861 1127.5931 1137.2945 1179.8753 1196.6071 1207.6389 1253.8177 1267.2705 1269.7624 1285.4042 1313.4353 1351.8876 1364.7016 1373.8814 1387.9497 1397.4191 1437.8999 1453.5800 1464.3705 1476.5822 1477.2918 1487.6684 1488.4322 1609.7449 1628.9378 1635.5576 2844.7609 2969.2296 2970.8377 2985.2119 3008.2481 3038.8442 3046.1101 3068.2361 3070.3251 3084.1960 3134.1913 3164.8369 3178.2853 3458.5308 3584.9851
redmass: 2.3214 4.1813 4.2807 2.5378 2.6877 4.6593 1.1371 3.7357 2.2861 1.5265 2.6077 3.3210 5.1348 3.1040 3.1901 2.3513 2.8660 4.3208 1.6639 3.0327 5.1424 9.5443 4.4722 2.8604 1.9457 5.2069 1.4178 1.6385 10.0757 1.4900 2.7400 1.3490 1.6988 2.2489 4.4427 1.7646 2.5005 3.2825 1.4601 1.6961 1.0362 1.5584 1.7010 1.6541 1.5503 1.5233 3.3719 1.2641 1.3296 1.3728 1.3063 1.4049 1.2891 1.7295 1.2388 3.7447 4.4036 1.0806 1.1095 1.0738 2.1588 1.3177 1.0466 7.8393 8.2215 1.1015 1.0813 1.0445 1.0549 1.0604 1.0533 1.0996 1.0979 1.1009 1.0989 1.1190 1.0896 1.0930 1.0954 1.0449 1.0971
irintensity: 14.3815 0.1410 0.0313 0.7445 0.8936 1.0116 18.4198 2.5207 13.6693 17.4947 7.9319 3.5045 0.5446 5.0238 3.6033 17.7310 2.2932 34.9778 126.8437 50.6626 3.8765 0.5826 1.9258 11.0059 7.5421 11.4681 25.7887 20.3812 31.9722 19.3523 1.4642 1.5256 6.4643 9.4249 129.0273 18.3004 5.6600 12.8498 4.3737 7.9902 0.0012 15.9265 2.3784 53.2734 7.8498 6.0045 164.1507 10.9677 1.7188 14.4240 0.1055 29.6127 0.6292 4.9117 13.9522 9.7581 47.3809 2.2871 8.2864 2.9036 132.2328 28.6560 12.8896 5.9097 0.4417 62.5873 81.1601 51.0912 34.9431 20.8585 130.1332 0.3491 19.7302 74.7236 46.0536 36.2109 12.5142 4.0470 4.8574 1.6027 0.4525
temp: 298.150 k
press: 1.00000 atm
elementType: 8 8 7 6 6 6 6 6 6 6 6 6 6 6 1 1 1 1 1 1 1 1 1 1 1 1 1 1 1
symmnumber: 1
zpe: 630042.6 jmol-1
zpe.correction: 0.239971 hartree
zpe.thermalcorrener: 0.253181 hartree
zpe.thermalcorrenthalpy: 0.254125 hartree
zpe.thermalcorrgfe: 0.199326 hartree
zpe.sumelectzpe: -632.273122 hartree
zpe.sumelectthermal: -632.259911 hartree
zpe.sumelectthermalent: -632.258967 hartree
zpe.sumelectthermalfe: -632.313766 hartree
dipole: -0.4570 -0.4367 1.0013
dipole: 1.1841
quadrupole: -74.2167 -80.4327 -87.2380
quadrupole: 7.2103 -4.2715 -0.1394
quadrupole: 6.4124 0.1965 -6.6089 7.2103 -4.2715 -0.1394
hfenergy: -632.5130922 hartree
pointgroup: C01 [X(C11H15N1O2)]
dipole: -0.1699789 -0.1758266 0.3965282 debye
polarizability: 177.9633248|16.1144755|116.1403373|8.8315144|-11.3103734|98.9851326 unknown
InChI: InChI=1S/C11H15NO2/c1-2-9(12)5-8-3-4-10-11(6-8)14-7-13-10/h3-4,6,9H,2,5,7,12H2,1H3
charge 0 multiplicity 1
29 atoms
O  2.730312 1.408829 -0.880187
O  3.600591 -0.114981 0.765192
N  -4.21942 -0.709333 -0.459143
C  -2.886153 -0.338719 0.059537
C  -1.821148 -0.839328 -0.964492
C  -2.811561 1.191834 0.266483
C  -0.384593 -0.688461 -0.487672
C  0.438049 0.359444 -1.000167
C  0.14332 -1.579391 0.483873
C  1.742484 0.458343 -0.511748
C  2.252439 -0.433276 0.45308
C  -3.78591 1.726247 1.340171
C  1.473707 -1.469096 0.973714
C  3.934032 1.065492 -0.076309
H  -2.654054 -0.820907 1.044207
H  -1.987151 -0.293533 -1.911515
H  -2.029872 -1.909293 -1.172052
H  -1.776308 1.452915 0.556282
H  -3.01795 1.680496 -0.706381
H  0.060639 1.057849 -1.752449
H  -0.491714 -2.387859 0.864186
H  -3.622938 2.805172 1.516269
H  -4.844323 1.605959 1.040259
H  -3.640327 1.202792 2.304566
H  -5.005124 -0.337265 0.081749
H  -4.33087 -1.707801 -0.662244
H  1.873048 -2.163272 1.717532
H  4.181925 1.917302 0.580873
H  4.75827 0.797942 -0.760315
