program: Gaussian 09
title: 000129908
version: EM64L-G09RevD.01
frameworkgroup: C1[X(C16H23NO3)]
method: RPBEPBE
basis: SDD
operation: Freq
keyword: #p
keyword: freq=noraman
keyword: PBEPBE/SDD
title: #p freq=noraman PBEPBE/SDD
converged: YES YES NO NO
title: Mulliken charges:
elementType: O O O N C C C C C C C C C C C C C C C C H H H H H H H H H H H H H H H H H H H H H H H
charge: -0.303833 -0.265105 -0.453244 -0.314215 -0.124614 -0.423953 -0.060007 -0.304420 -0.008328 0.295532 0.318127 -0.681020 -0.699309 0.418936 -0.525869 -0.518555 -0.357212 -0.445135 -0.222111 -0.668585 0.212191 0.226201 0.228439 0.213613 0.239669 0.238880 0.230093 0.211949 0.199953 0.232477 0.233940 0.208838 0.197131 0.267133 0.227354 0.223370 0.251021 0.243748 0.358792 0.220573 0.220375 0.219412 0.237768
chargesum: 0.00000
title: Mulliken charges with hydrogens summed into heavy atoms:
elementType: O O O N C C C C C C C C C C C C C C C C
charge: -0.303833 -0.265105 -0.094452 -0.074546 0.087576 0.030687 0.153606 0.164553 -0.008328 0.295532 0.318127 -0.036641 -0.059400 0.418936 -0.258736 -0.067831 -0.106190 -0.201388 -0.001538 0.008970
polarizability: 2.18685041e+02 1.42667923e+01 2.14695072e+02 -1.67458602e+01 1.73927062e+01 1.49395552e+02
1716.lowfreq: -5.5502 -4.1088 -0.0007 -0.0005 -0.0004 3.3351 13.3636 20.2233 37.2312
frequency: 13.1098 20.1891 37.1449 42.4790 56.2444 71.0539 91.3515 101.1949 131.8816 160.6203 177.8744 189.9234 210.1523 212.8065 213.8713 244.3336 259.8721 262.8482 284.9691 310.3781 336.6630 373.3068 380.8273 420.1654 442.8434 453.5190 460.8941 495.0092 503.1140 544.9784 564.5389 582.3610 604.5302 639.9623 666.9583 677.1086 723.7175 756.9512 770.2844 778.7050 819.3064 828.8878 831.8702 848.7101 863.1849 887.1778 903.5036 912.1588 917.8621 935.8451 938.0013 954.5737 960.4069 993.9440 1054.6902 1055.6480 1062.1350 1069.7684 1072.3668 1100.3960 1102.5850 1129.8157 1143.9062 1151.1352 1155.0156 1176.1464 1188.4015 1219.7699 1221.2081 1232.3713 1248.1293 1254.9075 1275.7044 1311.4822 1312.7614 1319.7892 1323.8362 1335.0808 1345.5448 1364.2214 1373.4070 1379.5795 1388.3026 1388.9048 1417.8308 1425.4845 1447.5092 1453.2618 1459.3968 1463.3772 1464.1848 1472.9251 1478.2465 1479.9696 1481.3999 1484.2846 1487.0600 1590.6071 1605.8143 1630.6727 2933.0578 2966.1610 2973.1808 2981.4243 2982.8005 2986.3848 2990.1784 3025.4003 3043.9683 3051.5523 3059.1606 3060.1870 3070.8810 3071.3361 3087.6146 3093.6462 3099.9753 3136.2295 3159.1450 3172.2493 3222.2951 3416.4722 3525.5491
redmass: 4.2865 4.2009 2.6279 2.7211 4.9539 4.0026 3.6449 3.4487 3.7849 2.3066 2.3680 3.9357 1.6609 2.0392 1.4791 1.8034 1.9189 1.8677 4.0369 2.9444 3.2189 4.8822 2.4114 2.4100 1.4560 2.7958 2.1313 3.2176 3.3371 4.0461 4.2257 4.2880 5.5800 4.1604 2.1034 2.3700 2.2126 4.3149 1.5943 1.4060 2.5915 1.4235 3.7091 3.2339 1.5008 4.2560 3.3818 1.2990 1.8896 2.5974 1.5021 1.3131 2.1859 1.8125 1.8079 2.2439 2.3136 1.6862 2.1909 2.0649 2.9695 2.1351 1.5508 1.5321 3.2358 2.0565 1.3664 2.0925 1.5117 1.3915 1.4119 1.7888 1.6623 1.4109 1.8476 1.2392 1.9022 1.3250 1.3904 1.3025 1.2687 1.3394 1.1996 1.2297 3.5021 6.2962 1.1631 1.1670 1.0877 1.0518 1.0522 1.0643 1.3943 1.5038 1.0911 1.0567 1.1014 6.9045 7.5084 9.1024 1.0670 1.0356 1.0428 1.0788 1.0552 1.0626 1.0359 1.0869 1.0923 1.0972 1.1090 1.0987 1.0972 1.0996 1.1006 1.1001 1.1009 1.0863 1.0929 1.0973 1.0984 1.0737 1.0652
irintensity: 0.2146 0.1509 0.0124 0.2002 0.4772 0.3123 3.3633 0.5955 2.7277 2.7609 4.6348 0.8027 3.0620 0.8548 1.5474 2.8952 1.0221 1.2844 0.6437 4.0525 1.4926 0.4297 0.2087 0.2133 96.1877 2.0441 71.7332 20.5288 3.9474 0.5634 11.7378 2.2302 2.1442 6.2588 36.3224 48.9417 37.9733 6.4599 25.7253 9.0099 5.9127 41.1569 0.4584 26.9089 10.9551 2.7664 61.2056 3.5630 4.9149 12.7346 0.8994 2.4746 14.2727 27.7876 7.5535 62.8175 44.1313 23.4952 76.4794 29.9713 43.2734 14.7121 7.3587 20.8538 84.4394 79.1639 47.8245 0.9316 13.6290 20.4201 13.3253 64.6795 40.6303 8.0556 7.3575 8.2802 28.0139 2.3568 5.4892 7.9337 42.5369 23.8509 7.0863 28.0355 20.4303 12.8878 19.0521 81.0100 8.1550 7.7643 0.9646 21.6600 21.1293 29.8998 5.3041 13.9695 11.3543 32.4480 51.8622 59.3196 57.4775 30.4028 21.3794 26.6576 24.5206 26.7630 36.7993 12.8555 48.1963 8.5506 22.0600 7.9729 82.6908 39.6519 45.5412 38.0040 34.6915 8.1216 19.8715 12.7006 4.3537 1.5735 20.5032
temp: 298.150 k
press: 1.00000 atm
elementType: 8 8 8 7 6 6 6 6 6 6 6 6 6 6 6 6 6 6 6 6 1 1 1 1 1 1 1 1 1 1 1 1 1 1 1 1 1 1 1 1 1 1 1
symmnumber: 1
zpe: 948471.5 jmol-1
zpe.correction: 0.361254 hartree
zpe.thermalcorrener: 0.382469 hartree
zpe.thermalcorrenthalpy: 0.383413 hartree
zpe.thermalcorrgfe: 0.308668 hartree
zpe.sumelectzpe: -902.359664 hartree
zpe.sumelectthermal: -902.338449 hartree
zpe.sumelectthermalent: -902.337505 hartree
zpe.sumelectthermalfe: -902.412249 hartree
dipole: 0.0592 0.2073 -2.2538
dipole: 2.2641
quadrupole: -101.1906 -111.0015 -131.4817
quadrupole: 6.4620 0.6036 -0.5112
quadrupole: 13.3673 3.5564 -16.9238 6.4620 0.6036 -0.5112
hfenergy: -902.7209177 hartree
pointgroup: C01 [X(C16H23N1O3)]
dipole: -0.0862002 0.5732858 0.6763131 debye
polarizability: 211.5843076|-16.9725435|190.0667144|-7.0255211|-41.4417251|181.124643 unknown
InChI: InChI=1S/C16H23NO3/c1-4-14-8-12-6-5-7-15(16(12)20-14)19-10-13(18)9-17-11(2)3/h5-8,11,13,17-18H,4,9-10H2,1-3H3
charge 0 multiplicity 1
43 atoms
O  0.161122 -0.897996 -0.380049
O  -1.483338 1.219309 -1.456994
O  2.065556 -1.944911 -2.059236
N  3.557173 -0.893332 1.2467
C  2.287946 -1.960651 -0.607413
C  3.134224 -0.741432 -0.162884
C  3.873948 0.355473 1.992154
C  0.952679 -2.035527 0.14366
C  -1.888385 0.349131 -0.425762
C  -1.125882 -0.701209 0.126153
C  -3.208245 0.663746 -0.001524
C  5.066593 1.157214 1.400957
C  4.12055 0.002188 3.472825
C  -2.586487 2.101533 -1.677003
C  -3.626632 1.79197 -0.821576
C  -2.384051 3.132975 -2.742963
C  -1.73858 -1.459485 1.15255
C  -3.809823 -0.103349 1.030967
C  -3.059426 -1.155642 1.590238
C  -1.222696 4.115151 -2.434411
H  2.853316 -2.891342 -0.414008
H  2.511117 0.169653 -0.242484
H  3.971228 -0.635571 -0.888271
H  2.966458 0.990158 1.930994
H  4.316834 -1.58318 1.346153
H  1.128613 -1.919347 1.229722
H  0.419642 -2.980127 -0.07794
H  5.214822 2.108751 1.945492
H  6.003827 0.57171 1.476133
H  4.896625 1.398886 0.33587
H  3.250277 -0.531969 3.891792
H  4.301206 0.912896 4.071742
H  5.009863 -0.65051 3.57802
H  -4.584454 2.307041 -0.779763
H  -2.181711 2.627541 -3.708113
H  -3.33025 3.690593 -2.864582
H  -1.197343 -2.286491 1.620122
H  -4.823805 0.112693 1.380611
H  1.346466 -1.281334 -2.2330
H  -3.495513 -1.766723 2.38813
H  -1.416386 4.676076 -1.502954
H  -1.102383 4.840673 -3.258819
H  -0.273098 3.566468 -2.313137
