program: Gaussian 09
title: 000129914
version: EM64L-G09RevD.01
frameworkgroup: C1[X(C12H21N5O5)]
method: RPBEPBE
basis: SDD
operation: Freq
keyword: #p
keyword: freq=noraman
keyword: PBEPBE/SDD
title: #p freq=noraman PBEPBE/SDD
converged: YES YES NO NO
title: Mulliken charges:
elementType: O O O O O N N N N N C C C C C C C C C C C C H H H H H H H H H H H H H H H H H H H H H
charge: -0.262467 -0.273194 -0.262559 -0.319506 -0.283828 -0.374097 -0.374227 -0.602791 -0.616254 -0.638865 -0.170060 -0.183600 -0.466900 -0.393347 0.198279 -0.507386 -0.476652 0.205642 0.232050 0.296539 0.184422 -0.777030 0.248230 0.269279 0.270262 0.240534 0.235241 0.230057 0.328868 0.216169 0.251568 0.225500 0.256381 0.327925 0.341298 0.329176 0.253383 0.262128 0.222464 0.317570 0.338899 0.385960 0.314937
chargesum: 0.00000
title: Mulliken charges with hydrogens summed into heavy atoms:
elementType: O O O O O N N N N N C C C C C C C C C C C C
charge: -0.262467 -0.273194 -0.262559 -0.319506 -0.283828 -0.045229 -0.046302 0.067682 0.040215 0.062032 0.078170 0.085680 0.043896 0.071951 0.198279 -0.039649 0.005230 0.205642 0.232050 0.296539 0.184422 -0.039055
polarizability: 2.11492390e+02 1.44295613e+00 1.81969291e+02 3.19676286e+00 -3.57617238e+00 1.48083978e+02
1716.lowfreq: -8.4514 -3.5142 -0.0006 -0.0002 0.0008 4.3230 9.4807 19.9943 23.6983
frequency: 9.4270 19.9680 23.6903 39.7462 42.6870 49.3118 60.9944 67.4946 74.1583 80.1707 87.4654 92.1198 99.0390 117.5025 125.1325 133.7104 168.4481 199.3192 225.4246 247.1075 263.3573 288.7489 291.1355 317.6121 381.3833 397.1127 424.0366 427.8318 462.9639 499.7278 517.3074 519.7045 530.9496 542.6499 564.2777 577.3151 588.7717 590.4599 601.8058 617.2583 619.7682 630.5576 672.9373 696.1523 713.0163 737.6381 744.7933 773.3751 780.6662 797.7345 831.7753 862.5157 907.0227 918.0083 938.1655 954.6826 967.0777 1006.3024 1029.2656 1037.2026 1045.1808 1046.1046 1056.0002 1058.0185 1082.1143 1094.4243 1109.4900 1126.4274 1167.6991 1185.4244 1214.3486 1230.3964 1240.9707 1264.1963 1274.4023 1277.4811 1287.4013 1291.8996 1310.6257 1335.4910 1337.5376 1354.5015 1367.8209 1373.2452 1381.3589 1391.8845 1447.4360 1450.1433 1451.4715 1463.2991 1465.3413 1475.4417 1492.5023 1498.6127 1595.1610 1596.0072 1598.4158 1621.0263 1623.8430 1644.3883 1645.7649 1647.3661 2982.3273 2996.4594 2999.0879 2999.9717 3008.3386 3024.6791 3029.0024 3038.4202 3061.3542 3070.0809 3096.7715 3105.1561 3108.6562 3385.0988 3501.1794 3517.2260 3517.2846 3539.5504 3612.9732 3669.4840 3673.2407
redmass: 6.8895 6.1776 5.0394 5.8548 5.0512 2.9578 2.5915 2.8934 3.3727 4.9053 4.2513 2.3116 4.5648 6.3275 3.6521 3.8485 5.0760 3.9398 4.4995 3.6789 4.3329 5.2830 4.3415 4.9890 3.1930 3.1641 2.4857 2.8073 2.8131 1.5037 1.2062 2.2765 2.0689 2.1640 1.4200 1.4474 2.7573 2.0148 2.2004 2.6111 1.4646 1.7597 2.1417 2.7453 3.9689 4.0268 5.3562 1.4295 1.5518 1.0873 4.2141 3.6503 3.2784 2.6445 2.3333 3.6517 2.7884 1.5716 3.5287 2.4564 1.9961 1.8894 2.5059 2.1264 2.4003 2.3352 2.2626 2.2910 1.3491 1.6532 1.3231 1.4162 1.4231 1.4585 1.2890 1.4069 1.3695 1.7701 1.3210 1.5015 1.5668 1.4748 2.8508 2.5304 2.5979 1.2325 1.1189 1.0593 1.1223 1.1429 1.1340 1.2372 1.8712 1.5444 1.6833 1.8293 3.2275 3.4871 2.9354 3.2735 2.9045 1.8354 1.0599 1.0611 1.0679 1.0363 1.0768 1.0640 1.0839 1.1008 1.0998 1.1028 1.0982 1.1001 1.1007 1.0577 1.0768 1.0450 1.0451 1.0783 1.0948 1.1044 1.1042
irintensity: 4.2528 1.4076 9.1990 5.6574 9.1994 3.1931 7.7648 1.9226 4.6199 5.4141 4.9192 2.8789 4.3505 14.2410 12.3498 3.7719 15.6556 3.5116 4.3891 9.0754 9.8509 10.0332 11.6859 4.4928 11.4374 4.4485 6.5336 17.1446 7.5214 53.1376 79.3070 9.2013 116.7038 35.9113 103.7827 95.7333 24.2895 37.4113 34.6961 51.9418 35.3351 189.1893 41.6552 77.8642 2.5962 16.8880 18.2333 20.8130 1.9097 107.5566 1.4898 5.8107 6.6330 3.3801 5.3559 1.9415 3.9386 3.1906 2.8828 1.7066 11.7875 5.6503 0.4762 0.3594 10.9267 3.3284 5.8850 9.8498 1.4121 1.6409 10.4089 11.8570 44.7743 22.2840 15.7201 0.8836 45.9914 51.0342 35.2528 24.9492 12.7611 35.0991 236.8169 172.3018 19.3199 62.6092 12.2122 30.6526 14.7573 96.2995 62.8721 79.8869 174.1901 124.9092 108.8354 276.1900 191.6382 111.9732 101.8679 308.8662 83.5730 357.4914 12.5535 16.1372 6.6416 7.6280 17.5338 11.7547 5.5758 7.0819 20.9925 25.6407 10.3470 14.6031 15.4380 429.3335 61.2011 48.8883 32.2024 30.1906 88.2111 28.8608 24.6126
temp: 298.150 k
press: 1.00000 atm
elementType: 8 8 8 8 8 7 7 7 7 7 6 6 6 6 6 6 6 6 6 6 6 6 1 1 1 1 1 1 1 1 1 1 1 1 1 1 1 1 1 1 1 1 1
symmnumber: 1
zpe: 912409.7 jmol-1
zpe.correction: 0.347519 hartree
zpe.thermalcorrener: 0.372556 hartree
zpe.thermalcorrenthalpy: 0.373500 hartree
zpe.thermalcorrgfe: 0.287468 hartree
zpe.sumelectzpe: -1118.145896 hartree
zpe.sumelectthermal: -1118.120859 hartree
zpe.sumelectthermalent: -1118.119914 hartree
zpe.sumelectthermalfe: -1118.205946 hartree
dipole: -5.8756 1.8154 -2.0364
dipole: 6.4780
quadrupole: -142.0374 -109.4979 -133.5159
quadrupole: 16.2622 29.1590 5.2749
quadrupole: -13.6870 18.8525 -5.1655 16.2622 29.1590 5.2749
hfenergy: -1118.4934146 hartree
pointgroup: C01 [X(C12H21N5O5)]
dipole: 2.2435055 -0.7668484 -0.9350277 debye
polarizability: 210.8314965|1.1126781|182.0772025|-7.3414412|2.7978701|148.6369596 unknown
InChI: InChI=1S/C12H21N5O5/c1-6(18)16-8(3-5-10(14)20)12(22)17-7(11(15)21)2-4-9(13)19/h7-8,16-17H,2-5,13-15H2,1H3
charge 0 multiplicity 1
43 atoms
O  0.076927 0.136501 1.952144
O  -1.616615 -3.314156 -0.983133
O  5.48696 -0.269172 0.709199
O  -0.343228 2.545993 -0.732811
O  -5.238191 1.662908 -0.040324
N  -0.699694 -0.977444 0.054306
N  1.630006 1.770289 0.192423
N  -2.883402 -3.779283 0.910149
N  5.975958 -1.112143 -1.395434
N  -3.285339 2.658038 -0.839263
C  1.351717 0.365757 -0.153637
C  -1.931896 -1.508033 0.648192
C  2.629594 -0.483054 0.043894
C  -3.161601 -0.643119 0.216945
C  0.184865 -0.166953 0.724615
C  3.726035 -0.153945 -0.997502
C  -3.074468 0.807813 0.758144
C  -2.113399 -2.948825 0.126053
C  5.124373 -0.520658 -0.478458
C  0.724217 2.774521 -0.072254
C  -3.969654 1.74604 -0.060116
C  1.064037 4.155851 0.465209
H  1.030145 0.341315 -1.212905
H  -1.813903 -1.479093 1.747328
H  3.034644 -0.312751 1.059711
H  2.36381 -1.55406 -0.015359
H  -4.101798 -1.115807 0.555626
H  -3.190617 -0.633313 -0.88971
H  -0.543502 -1.24528 -0.9232
H  3.509137 -0.643068 -1.965674
H  3.734489 0.938918 -1.182841
H  -3.412231 0.834338 1.809798
H  -2.031935 1.160039 0.731795
H  2.386463 1.94616 0.857675
H  -3.088365 -4.721177 0.576302
H  -3.255798 -3.480222 1.809911
H  0.97489 4.8951 -0.348461
H  0.328133 4.429977 1.241663
H  2.075949 4.219406 0.8994
H  5.682753 -1.334388 -2.344866
H  6.925694 -1.341262 -1.101205
H  -2.256825 2.699131 -0.859067
H  -3.830837 3.290613 -1.424962
