program: Gaussian 09
title: 000129876
version: EM64L-G09RevD.01
frameworkgroup: C1[X(C10H14N4O6)]
method: RPBEPBE
basis: SDD
operation: Freq
keyword: #p
keyword: freq=noraman
keyword: PBEPBE/SDD
title: #p freq=noraman PBEPBE/SDD
converged: YES YES NO NO
title: Mulliken charges:
elementType: O O O O O O N N N N C C C C C C C C C C H H H H H H H H H H H H H H
charge: -0.260307 -0.445637 -0.480933 -0.431275 -0.292702 -0.310125 -0.084451 -0.147209 -0.640528 -0.609827 -0.135901 -0.167753 -0.082828 -0.090577 -0.318559 -0.211369 0.069071 -0.003621 0.160970 0.218553 0.253262 0.235770 0.280954 0.261159 0.209954 0.200977 0.382209 0.366570 0.314582 0.358532 0.389832 0.322725 0.346917 0.341562
chargesum: 0.00000
title: Mulliken charges with hydrogens summed into heavy atoms:
elementType: O O O O O O N N N N C C C C C C C C C C
charge: -0.260307 -0.063428 -0.114363 -0.072743 -0.292702 -0.310125 -0.084451 -0.147209 0.072029 0.078652 0.117361 0.068017 0.198127 0.170582 0.092373 0.103213 0.069071 -0.003621 0.160970 0.218553
polarizability: 2.01371355e+02 2.97346690e+00 1.59720954e+02 -8.14244420e+00 -8.63817044e+00 1.03399416e+02
1716.lowfreq: -10.3108 -0.0005 -0.0004 0.0002 2.0847 5.3302 17.0193 29.6129 52.0887
frequency: 16.3803 29.4896 52.0795 63.4161 72.3522 93.7171 107.1065 120.2809 175.8195 182.6835 189.5843 190.4984 213.1446 233.4053 281.9796 288.9548 308.9016 314.9422 359.7609 360.3376 393.0102 404.6221 456.1290 460.3728 496.5521 507.4278 541.7932 555.8839 581.0986 599.2858 612.6202 640.6782 649.7215 663.3859 672.6455 700.9184 732.2650 746.0804 779.8198 793.9919 813.8096 869.8882 871.9863 875.7051 927.0115 972.3445 992.9278 994.7544 1009.1470 1024.8697 1048.3121 1061.3599 1065.1037 1087.2659 1093.3355 1112.6759 1130.0490 1156.6403 1180.4548 1197.0131 1214.3805 1241.0456 1273.4811 1289.9624 1294.7245 1312.6303 1321.3416 1325.3095 1342.8096 1344.1598 1355.0337 1363.6902 1383.3214 1385.2302 1413.0338 1460.6616 1469.4917 1525.2916 1563.8870 1593.0980 1618.5272 1655.6425 2961.7753 3018.2662 3030.3718 3035.7406 3054.4865 3091.0072 3212.0068 3248.3812 3478.8346 3516.1280 3547.3027 3606.9278 3612.7115 3676.4159
redmass: 6.7601 6.8011 6.5528 5.7235 6.9910 4.5265 7.6000 4.1970 2.9059 3.1947 5.7484 1.6131 6.1347 6.3256 4.8368 5.0153 6.7175 5.5575 3.6300 4.6879 6.3463 5.9639 1.2481 1.2157 3.7437 2.9167 1.6370 5.3063 3.4194 1.6679 1.1440 3.6270 2.2974 3.7729 4.2484 4.2479 5.4889 5.4017 5.8353 3.1904 6.0046 1.5855 3.1837 1.0887 3.8786 4.1794 5.9671 3.5697 2.6855 3.0771 3.3634 3.6720 2.7012 2.3205 2.6801 1.8126 1.7042 1.3204 1.1931 2.2609 1.4502 1.3314 1.5123 2.3699 1.3090 1.2713 5.9136 1.4695 1.5621 1.7432 1.3495 1.8990 1.6969 1.5641 3.1925 1.0943 5.8348 5.9916 2.2119 1.8983 3.9649 1.6011 1.0647 1.0848 1.0867 1.0866 1.0986 1.0878 1.0704 1.1007 1.0648 1.0447 1.0656 1.0866 1.0671 1.1051
irintensity: 0.3898 0.0970 0.5994 2.1727 0.0489 11.9466 8.0335 9.2846 30.7248 25.3368 2.4490 115.4307 9.3118 7.9962 21.1642 4.6086 16.1265 11.2585 6.7852 7.7757 6.3961 6.6736 97.9733 110.1029 37.1036 13.2315 15.7187 1.4765 39.9654 221.3782 84.9523 9.4411 6.6036 2.8357 24.9680 22.6306 85.4733 55.7357 3.1878 14.7225 108.4075 6.7767 3.4792 181.9937 95.8564 96.5651 47.3340 146.5926 94.3894 51.0925 14.2606 16.5908 3.0439 3.1516 8.7353 66.6050 31.4453 26.9637 22.3218 11.3971 23.9871 6.0239 33.2626 58.4626 22.6832 4.9993 30.1278 17.9168 19.5379 34.5147 10.1921 100.0638 34.0217 54.6732 18.2279 1.6299 77.9742 90.3886 199.0244 429.9259 270.3560 54.1309 38.1699 6.6558 3.0924 71.9106 54.0613 5.7026 445.4708 7.7012 64.9534 41.7559 10.6910 82.2789 23.8380 73.1749
temp: 298.150 k
press: 1.00000 atm
elementType: 8 8 8 8 8 8 7 7 7 7 6 6 6 6 6 6 6 6 6 6 1 1 1 1 1 1 1 1 1 1 1 1 1 1
symmnumber: 1
zpe: 675680.2 jmol-1
zpe.correction: 0.257353 hartree
zpe.thermalcorrener: 0.276700 hartree
zpe.thermalcorrenthalpy: 0.277644 hartree
zpe.thermalcorrgfe: 0.208147 hartree
zpe.sumelectzpe: -1058.295972 hartree
zpe.sumelectthermal: -1058.276625 hartree
zpe.sumelectthermalent: -1058.275681 hartree
zpe.sumelectthermalfe: -1058.345178 hartree
dipole: 4.3616 5.2831 -2.7948
dipole: 7.3990
quadrupole: -120.1581 -115.9294 -128.3382
quadrupole: 1.0842 -3.8751 -7.0788
quadrupole: 1.3171 5.5458 -6.8630 1.0842 -3.8751 -7.0788
hfenergy: -1058.5533251 hartree
pointgroup: C01 [X(C10H14N4O6)]
dipole: 1.5654419 -1.7630881 1.7072781 debye
polarizability: 197.9284744|2.2171639|153.7480203|19.736338|-18.9983444|112.8152307 unknown
InChI: InChI=1S/C10H14N4O6/c11-8(18)3-1-14(13-5(3)9(12)19)10-7(17)6(16)4(2-15)20-10/h1,4,6-7,10,15-17H,2,11-12H2
charge 0 multiplicity 1
34 atoms
O  2.256186 1.02133 -1.031276
O  3.085738 2.337564 1.618401
O  4.096323 -0.042676 1.887552
O  3.082283 -1.22061 -2.628682
O  -3.600029 2.367324 -1.611298
O  -3.469843 -1.880413 0.350457
N  0.050318 1.094749 -0.028315
N  -0.259466 -0.163288 0.465701
N  -4.486926 0.314132 -0.940971
N  -1.431775 -2.476149 1.278839
C  2.13681 1.266259 1.363557
C  2.882107 -0.068374 1.065251
C  1.433139 1.601419 0.031932
C  3.156895 -0.03383 -0.461212
C  2.848384 -1.346344 -1.193037
C  -1.036669 1.700086 -0.618876
C  -2.12681 0.822253 -0.510461
C  -1.593385 -0.330533 0.175001
C  -3.46812 1.223256 -1.062647
C  -2.247236 -1.606015 0.597212
H  1.421562 1.163298 2.199938
H  2.237892 -0.92597 1.334816
H  1.395363 2.690548 -0.127304
H  4.190657 0.299722 -0.668685
H  1.801342 -1.647559 -0.975336
H  3.532904 -2.146723 -0.856549
H  3.895349 1.919241 2.021863
H  4.640695 -0.854016 1.745677
H  -1.008253 2.685799 -1.075994
H  2.54917 -0.448713 -2.952412
H  -4.326967 -0.605787 -0.485765
H  -5.398759 0.57771 -1.313737
H  -0.462083 -2.222172 1.46627
H  -1.814297 -3.366617 1.592191
