program: Gaussian 09
title: 000129921
version: EM64L-G09RevD.01
frameworkgroup: C1[X(C22H26O6)]
method: RPBEPBE
basis: SDD
operation: Freq
keyword: #pfreq=noraman
keyword: PBEPBE/SDD
title: #p freq=noraman PBEPBE/SDD
converged: YES YES NO NO
title: Mulliken charges:
elementType: O O O O O O C C C C C C C C C C C C C C C C C C C C C C H H H H H H H H H H H H H H H H H H H H H H H H H H
charge: -0.304743 -0.309378 -0.279016 -0.306574 -0.311955 -0.289778 0.636656 0.635556 0.032531 0.020121 0.231778 0.275256 0.261936 0.236365 -0.596072 -0.585757 -0.582873 -0.597274 -0.373532 -0.371855 -0.204248 -0.206965 -0.526296 -0.523934 -0.494931 -0.528215 -0.526284 -0.524890 0.255646 0.248629 0.247930 0.255440 0.229456 0.229012 0.217971 0.219254 0.212609 0.227600 0.267710 0.255177 0.233185 0.225836 0.208019 0.227271 0.246971 0.228736 0.221820 0.252600 0.223024 0.227571 0.249297 0.228259 0.261541 0.213805
chargesum: 0.00000
title: Mulliken charges with hydrogens summed into heavy atoms:
elementType: O O O O O O C C C C C C C C C C C C C C C C C C C C C C
charge: -0.304743 -0.309378 -0.279016 -0.306574 -0.311955 -0.289778 0.636656 0.635556 0.032531 0.020121 0.231778 0.275256 0.261936 0.236365 -0.340426 -0.337128 -0.334943 -0.341834 -0.144075 -0.142843 0.013723 0.012290 0.181624 0.190264 0.187330 0.174941 0.173609 0.178715
polarizability: 7.17463864e+02 2.65522945e+01 2.78249600e+02 -4.20234415e+00 2.81835448e+00 1.44898852e+02
1716.lowfreq: -5.1901 -1.8965 -0.0010 0.0008 0.0016 10.8598 11.6065 16.8899 19.7910
frequency: 11.5522 16.8414 19.7463 21.9109 42.1064 67.8515 74.2095 77.7839 84.0958 92.0045 98.3477 101.3490 121.0115 136.6814 140.1536 150.2613 155.7521 160.4979 164.0620 168.0741 169.1788 187.6645 196.8109 199.6230 211.0058 228.8826 235.7030 243.1934 257.6354 282.8221 286.4457 311.0415 320.9360 331.2145 341.6228 361.3799 365.8226 380.6558 392.6441 444.0265 449.4809 473.2387 497.0378 505.0737 518.9734 593.5975 598.5283 606.3173 624.6623 633.8713 643.9482 657.5643 662.9612 737.3014 746.6195 755.2178 766.1191 836.8082 864.8369 866.0439 871.5662 876.2569 881.9956 901.3187 908.3664 912.3702 919.2008 937.5312 939.2200 943.2292 1001.7773 1010.0056 1018.6928 1034.4125 1043.9224 1109.0583 1109.8582 1112.2651 1112.6140 1113.8342 1114.6302 1116.2206 1119.4715 1150.3624 1150.8116 1154.8546 1155.6084 1158.0283 1158.9027 1176.9237 1191.6554 1196.6955 1217.8532 1225.3362 1227.4000 1281.5349 1296.4740 1304.3902 1314.5673 1332.7615 1360.5321 1378.8244 1400.5058 1406.1881 1419.5257 1421.2016 1434.1972 1434.6869 1436.7557 1445.3192 1454.4926 1455.1097 1456.5890 1457.9865 1458.5656 1460.1074 1466.4017 1468.7017 1469.2096 1477.3956 1478.1567 1484.3032 1486.4412 1487.0830 1556.4162 1560.0116 1594.6193 1601.1921 1623.6868 1633.8958 2967.8279 2970.6769 2971.3603 2973.0302 2978.6188 2982.0621 3067.5073 3069.3515 3073.2114 3079.1949 3079.9813 3084.5796 3084.9831 3088.5232 3091.2017 3101.9240 3118.2065 3120.4765 3120.6653 3121.3396 3123.9889 3125.1304 3151.2684 3151.2934 3164.2074 3166.8450
redmass: 2.9624 4.5348 5.0501 5.3070 4.1364 3.5381 3.7114 2.9858 3.2079 3.0040 3.4878 3.0575 2.7966 2.5931 1.9287 2.0477 1.5943 1.1556 1.3498 1.1638 1.1926 2.7478 2.5516 3.3054 2.4742 2.2737 2.3823 4.5892 4.5400 5.2388 4.0446 3.2882 4.8257 3.7803 4.9394 4.9968 4.8828 6.4149 5.5436 5.2719 5.2336 5.4374 5.7228 5.4339 5.6356 5.0754 4.1662 6.5772 4.8825 3.2238 4.4854 3.5175 4.4147 4.2860 4.4571 3.8839 3.4419 1.6169 3.0483 4.1843 1.9589 1.9079 1.8177 2.2581 4.5323 2.0664 6.2929 9.4428 9.3637 1.2513 1.1054 4.0643 3.4588 6.6756 5.5492 1.2694 1.2400 1.3405 1.6053 1.3214 1.4654 1.5008 2.5296 1.3558 1.3559 1.4545 1.4317 1.4804 1.4866 2.4884 1.9850 1.9311 1.4146 1.3038 1.7531 1.5490 5.2129 1.8778 1.4719 4.1760 4.7882 4.3436 2.5844 1.8780 1.2892 1.2828 1.3708 1.2714 1.4636 1.3612 1.1150 1.1197 1.0610 1.0691 1.0733 1.0709 2.0733 1.0896 2.3845 1.0669 1.0871 1.0548 1.0586 1.0544 7.0735 6.8102 5.8352 6.6189 5.7608 5.2806 1.0329 1.0312 1.0313 1.0336 1.0295 1.0333 1.1034 1.1035 1.0998 1.1021 1.1019 1.0916 1.0917 1.0983 1.0874 1.0867 1.1027 1.1028 1.1040 1.1034 1.1055 1.1043 1.0915 1.0913 1.0914 1.0915
irintensity: 2.8132 2.5947 0.3688 0.7032 0.3505 1.3882 4.6839 2.1788 4.6584 3.9203 7.0363 3.1438 4.3159 0.8710 0.9827 1.9435 2.0376 0.2835 1.0474 0.8405 0.1443 1.0850 1.4385 9.2817 3.7728 1.2368 0.4464 9.3612 18.6418 4.7538 22.2674 4.0622 2.6798 0.5964 2.7300 2.3091 4.1374 25.3184 0.7222 2.4323 3.6730 18.5084 2.2015 0.9192 1.2985 10.5803 5.8406 1.9217 19.4052 20.3764 4.3461 0.6307 20.4453 3.1303 3.6129 7.0501 7.9530 15.9108 2.7753 12.2568 2.5189 10.8582 5.2015 21.4600 83.5991 3.3514 2.8385 134.8323 41.8462 0.0177 123.4304 192.2400 22.5357 139.2533 184.4264 4.4910 15.4588 17.6392 15.8452 5.6558 22.3352 20.0318 1.2019 2.1774 1.9288 2.1770 8.4054 0.5742 47.9129 2.8157 140.2027 0.7839 27.8059 62.9597 15.3582 0.2870 507.1880 0.7073 119.3815 16.2510 41.6458 26.1826 123.6421 3.6229 28.0554 8.0927 41.4121 71.8529 4.5387 2.0824 82.5643 20.3246 9.4003 28.9411 6.2539 0.6172 241.2078 11.7825 3.1118 1.7461 12.7105 18.2982 51.1801 21.4014 174.2090 38.6826 12.4104 112.9637 30.8722 0.2483 118.1005 84.4652 57.1714 130.6252 89.2472 101.1692 26.2729 27.4787 28.2798 22.5659 35.1684 5.3402 3.6504 48.7456 0.0051 91.1083 27.1840 24.1027 27.7189 33.2871 23.1221 19.4516 2.4645 6.5832 1.6431 1.5636
temp: 298.150 k
press: 1.00000 atm
elementType: 8 8 8 8 8 8 6 6 6 6 6 6 6 6 6 6 6 6 6 6 6 6 6 6 6 6 6 6 1 1 1 1 1 1 1 1 1 1 1 1 1 1 1 1 1 1 1 1 1 1 1 1 1 1
symmnumber: 1
zpe: 1129205.0 jmol-1
zpe.correction: 0.430091 hartree
zpe.thermalcorrener: 0.461020 hartree
zpe.thermalcorrenthalpy: 0.461965 hartree
zpe.thermalcorrgfe: 0.364518 hartree
zpe.sumelectzpe: -1303.059843 hartree
zpe.sumelectthermal: -1303.028914 hartree
zpe.sumelectthermalent: -1303.027970 hartree
zpe.sumelectthermalfe: -1303.125416 hartree
dipole: 0.6245 0.1650 -1.2747
dipole: 1.4290
quadrupole: -105.2741 -158.0598 -165.0826
quadrupole: -10.4934 -0.0766 -3.6934
quadrupole: 37.5314 -15.2543 -22.2771 -10.4934 -0.0766 -3.6934
hfenergy: -1303.4899342 hartree
pointgroup: C01 [X(C22H26O6)]
dipole: -0.249583 -0.071215 -0.4987287 debye
polarizability: 717.585382|25.7640431|278.0532846|-0.4834465|-4.8145352|144.9736495 unknown
InChI: InChI=1S/C22H26O6/c1-23-17-11-15(12-18(24-2)21(17)27-5)9-7-8-10-16-13-19(25-3)22(28-6)20(14-16)26-4/h7-14H,1-6H3
charge 0 multiplicity 1
54 atoms
O  -7.38482 0.27974 0.021571
O  7.410339 -0.20223 0.028023
O  -6.218311 -2.485598 0.205171
O  5.571764 -2.429839 0.07072
O  -5.536913 2.441921 -0.163135
O  6.298193 2.467682 -0.198187
C  -3.156902 -0.43067 0.00047
C  3.181594 0.42741 -0.173741
C  -5.991938 0.024769 -0.012617
C  6.013222 -0.001637 -0.084868
C  -5.480027 -1.301963 0.086975
C  5.102713 -1.100793 -0.066838
C  -5.059968 1.108111 -0.071612
C  5.489845 1.315871 -0.21347
C  -4.0780 -1.504284 0.096073
C  3.714527 -0.892466 -0.096897
C  -3.67611 0.895573 -0.079976
C  4.093929 1.515951 -0.255176
C  -1.72091 -0.730429 0.001156
C  1.742995 0.712821 -0.18968
C  -0.686966 0.173294 -0.106252
C  0.712651 -0.196162 -0.090198
C  -7.935457 0.876992 -1.220006
C  7.833516 -0.672101 1.372389
C  -7.667359 -2.527333 -0.049019
C  6.426672 -2.909381 -1.039936
C  -6.167242 2.945093 1.07939
C  7.410195 2.520159 -1.172586
H  -3.722181 -2.537615 0.168101
H  3.067528 -1.773655 -0.063577
H  -3.023456 1.771107 -0.135145
H  3.728509 2.545554 -0.332774
H  -1.459567 -1.794793 0.099771
H  1.474439 1.775648 -0.285847
H  -0.908868 1.24541 -0.211505
H  0.937087 -1.2678 0.014528
H  -7.843927 0.161794 -2.060709
H  -8.997504 1.072957 -1.005802
H  -7.407836 1.815588 -1.462607
H  7.340583 -1.630031 1.616877
H  7.585574 0.090837 2.13283
H  8.924568 -0.803669 1.3083
H  -7.904271 -2.181482 -1.072677
H  -7.925968 -3.593125 0.051965
H  -8.22374 -1.918231 0.680399
H  6.718662 -3.933376 -0.761077
H  5.848196 -2.926918 -1.983258
H  7.319006 -2.268936 -1.15637
H  -5.427234 2.959047 1.902203
H  -6.491413 3.971865 0.850034
H  -7.033702 2.320149 1.362133
H  7.910932 3.481553 -0.981398
H  8.106567 1.679177 -1.021285
H  7.010987 2.504243 -2.205353
