program: Gaussian 09
title: 000129852
version: EM64L-G09RevD.01
frameworkgroup: C1[X(C8H19N3O)]
method: RPBEPBE
basis: SDD
operation: Freq
keyword: #p
keyword: freq=noraman
keyword: PBEPBE/SDD
title: #p freq=noraman PBEPBE/SDD
converged: YES YES NO NO
title: Mulliken charges:
elementType: O N N N C C C C C C C C H H H H H H H H H H H H H H H H H H H
charge: -0.275815 -0.277314 -0.365106 -0.570691 -0.350717 -0.374776 -0.353691 -0.376323 -0.377739 -0.370918 0.253039 -0.767928 0.204431 0.160851 0.223228 0.205108 0.170316 0.203472 0.206996 0.206683 0.241497 0.204762 0.262539 0.174533 0.202156 0.294790 0.261070 0.272472 0.252794 0.253997 0.206284
chargesum: 0.00000
title: Mulliken charges with hydrogens summed into heavy atoms:
elementType: O N N N C C C C C C C C
charge: -0.275815 -0.035818 -0.070317 -0.037149 0.014564 0.053560 0.020096 0.037357 0.089563 0.005771 0.253039 -0.054852
polarizability: 1.45365209e+02 -2.20928484e+00 1.02067815e+02 5.48319078e+00 3.42730479e+00 9.45301927e+01
1716.lowfreq: -11.3233 -3.7858 -0.0009 -0.0007 -0.0007 7.6188 14.8537 26.4062 36.7383
frequency: 12.8140 26.0862 36.5548 62.7992 77.7455 81.1415 100.8403 120.5179 147.3535 159.4732 174.6200 226.6555 250.4397 295.1180 333.5963 380.7359 441.1466 479.4591 506.6822 553.1038 592.0839 607.0924 607.3561 672.4945 761.7443 771.7188 838.6321 872.1349 905.0281 956.0187 963.4680 988.8991 1018.7956 1039.6932 1050.9623 1068.9195 1096.2653 1107.6424 1110.5538 1132.1871 1151.3362 1153.6154 1197.8703 1234.8188 1244.6573 1260.9667 1268.4180 1275.5893 1280.7297 1295.8814 1319.4912 1354.7761 1360.1902 1386.8216 1388.6537 1395.2820 1449.6305 1451.4904 1457.2145 1460.4465 1467.7648 1468.9119 1484.9946 1488.2421 1492.8134 1500.4923 1622.2783 1639.7946 2812.2319 2838.4642 2861.0387 2978.8930 2979.4198 2982.8313 2987.1960 2989.9775 2993.7916 3004.6529 3046.3650 3052.9467 3074.3871 3095.2222 3099.0996 3422.4404 3453.4689 3559.2384 3580.8951
redmass: 4.4563 3.2716 2.2942 3.1308 1.2251 3.0335 1.9960 2.6741 1.9998 2.6241 3.9233 3.5682 1.1925 2.4445 2.8603 3.2393 2.7768 2.9490 2.0858 1.5757 3.7289 1.7887 1.5690 1.3046 1.4027 1.0871 1.7073 1.2307 2.5103 2.3953 2.1296 1.5816 2.2531 1.6460 3.0512 1.8634 2.3576 2.5576 3.3144 1.8698 2.0412 2.1366 1.4248 1.3790 1.5336 1.5674 1.1730 1.1898 1.0965 1.2436 1.2709 1.4336 1.2997 1.2300 1.4280 1.5493 1.0457 1.2083 1.1512 1.0804 1.0798 1.0743 1.1194 1.7161 1.0886 1.0866 6.2322 1.0940 1.0711 1.0712 1.0719 1.0752 1.0651 1.0700 1.0839 1.0637 1.0364 1.0868 1.1035 1.1010 1.0971 1.1003 1.0980 1.0741 1.0448 1.0776 1.0975
irintensity: 2.7293 9.4959 0.6980 0.7452 3.1262 2.3491 4.9538 3.0129 1.6997 4.7122 2.7278 2.3291 49.7395 9.1021 9.9463 6.0803 14.3501 25.0521 13.2193 121.9250 5.1870 61.8372 161.4679 98.4471 9.1614 6.4657 1.6403 1.0275 0.7002 3.6954 4.2613 2.2806 3.5546 16.2187 17.3227 12.4492 7.6678 24.9549 19.2894 0.9777 17.1527 29.6022 5.1899 3.2184 4.4956 112.2756 2.5241 1.8476 5.9003 12.7174 8.5586 17.1489 0.8781 54.3789 20.4084 8.2910 17.6503 14.6876 93.9019 7.9742 28.1259 4.6224 29.8934 148.8791 0.1518 3.7189 200.3077 40.0094 123.2845 135.0082 121.2153 19.0216 21.2508 11.7945 25.8804 78.5852 12.3074 29.5723 78.2706 59.4111 4.4995 24.3095 9.4805 1.4187 1.5991 12.7276 0.2396
temp: 298.150 k
press: 1.00000 atm
elementType: 8 7 7 7 6 6 6 6 6 6 6 6 1 1 1 1 1 1 1 1 1 1 1 1 1 1 1 1 1 1 1
symmnumber: 1
zpe: 717725.3 jmol-1
zpe.correction: 0.273367 hartree
zpe.thermalcorrener: 0.289149 hartree
zpe.thermalcorrenthalpy: 0.290094 hartree
zpe.thermalcorrgfe: 0.226726 hartree
zpe.sumelectzpe: -554.717328 hartree
zpe.sumelectthermal: -554.701546 hartree
zpe.sumelectthermalent: -554.700602 hartree
zpe.sumelectthermalfe: -554.763969 hartree
dipole: 3.1353 2.0888 3.5295
dipole: 5.1624
quadrupole: -84.4703 -72.8003 -77.6293
quadrupole: -9.5744 -4.8209 0.3705
quadrupole: -6.1704 5.4997 0.6707 -9.5744 -4.8209 0.3705
hfenergy: -554.9906954 hartree
pointgroup: C01 [X(C8H19N3O1)]
dipole: -1.2554802 -0.6383556 1.4633705 debye
polarizability: 145.3627305|-3.4206595|101.2711719|-4.8185258|-4.1554547|95.3293142 unknown
InChI: InChI=1S/C8H19N3O/c1-8(12)11-7-3-6-10-5-2-4-9/h10-11H,2-7,9H2,1H3
charge 0 multiplicity 1
31 atoms
O  4.646699 0.135508 -0.93968
N  -1.389624 0.60622 -0.202092
N  2.958123 -0.068955 0.65277
N  -6.217965 -0.511257 -0.509273
C  -0.112993 0.606739 0.538682
C  1.01351 1.229181 -0.309853
C  -2.537001 0.025353 0.528175
C  -3.808719 0.048103 -0.340674
C  2.384105 1.265642 0.40395
C  -5.036772 -0.547111 0.376774
C  4.056415 -0.548962 -0.048808
C  4.511395 -1.957912 0.328957
H  -0.251906 1.206761 1.461746
H  0.188643 -0.423642 0.870362
H  0.719533 2.262688 -0.574764
H  1.124018 0.669919 -1.260555
H  -2.342573 -1.025207 0.869929
H  -2.700038 0.629068 1.444238
H  -3.645664 -0.524272 -1.275542
H  -4.013415 1.096532 -0.636734
H  -1.281941 0.174134 -1.131494
H  2.294034 1.808496 1.366395
H  3.119323 1.798791 -0.223072
H  -5.180174 -0.008238 1.347364
H  -4.832148 -1.606154 0.628733
H  2.51453 -0.671673 1.346682
H  -6.470709 0.432894 -0.819292
H  -7.030337 -1.026319 -0.156575
H  4.497907 -2.594024 -0.572689
H  5.556072 -1.915583 0.682376
H  3.889771 -2.43062 1.109764
