program: Gaussian 09
title: 000129874
version: EM64L-G09RevD.01
frameworkgroup: C1[X(C9H13N5O6)]
method: RPBEPBE
basis: SDD
operation: Freq
keyword: #p
keyword: freq=noraman
keyword: PBEPBE/SDD
title: #p freq=noraman PBEPBE/SDD
converged: NO YES NO NO
title: Mulliken charges:
elementType: O O O O O O N N N N N C C C C C C C C C H H H H H H H H H H H H H
charge: -0.259560 -0.464241 -0.437905 -0.433786 -0.305920 -0.265047 -0.103485 -0.081727 -0.049100 -0.607374 -0.632497 -0.249960 -0.122901 -0.062930 -0.084413 -0.335763 -0.000302 0.015652 0.231660 0.165170 0.294901 0.249156 0.272458 0.294940 0.220040 0.224818 0.371831 0.370361 0.352346 0.366283 0.345782 0.391134 0.330378
chargesum: 0.00000
title: Mulliken charges with hydrogens summed into heavy atoms:
elementType: O O O O O O N N N N N C C C C C C C C C
charge: -0.259560 -0.093880 -0.066074 -0.081440 -0.305920 -0.265047 -0.103485 -0.081727 -0.049100 0.104691 0.089015 0.044942 0.126255 0.209528 0.210527 0.109096 -0.000302 0.015652 0.231660 0.165170
polarizability: 1.97353017e+02 3.26956866e+00 1.55478189e+02 -8.12046757e+00 -1.09362685e+01 1.03008493e+02
1716.lowfreq: -5.7857 -0.0009 -0.0004 0.0004 2.5253 6.6652 22.0930 33.9265 48.3225
frequency: 22.0697 33.9056 48.3159 62.7538 70.3181 99.3883 104.1265 128.7749 178.7836 181.0888 188.3971 214.6693 239.5188 252.7406 283.8825 306.3179 309.6838 316.6232 359.1190 367.9526 389.1633 408.8889 448.0288 497.1197 504.7455 549.8509 554.9793 565.1399 598.0319 606.3039 640.7307 641.6291 663.1702 667.9974 676.5338 698.9953 735.2814 754.6011 790.1336 791.2241 811.7399 866.8749 878.2585 930.7215 967.9431 976.5560 988.4116 1011.9972 1019.5425 1041.2567 1061.7551 1069.7684 1092.5730 1108.9722 1124.3686 1147.5765 1170.7284 1181.8003 1213.2200 1249.2286 1260.5737 1271.2546 1281.9421 1295.4859 1301.8383 1306.1981 1319.4710 1336.5208 1343.4146 1347.0491 1376.6129 1383.7456 1395.3677 1424.9896 1463.7630 1480.7317 1567.9509 1602.0206 1629.2093 1662.4595 2976.7112 3019.8938 3050.8519 3059.9769 3078.4736 3115.0097 3178.6804 3416.6129 3508.6034 3547.9273 3591.5137 3603.6001 3667.7006
redmass: 7.4741 6.7475 6.5453 6.0494 8.3751 5.1008 7.5435 4.0687 4.7237 7.8902 4.9313 6.6283 6.3112 2.7067 6.6477 2.9347 6.4012 2.1763 5.6459 3.0050 5.9269 5.0474 1.3184 4.8359 2.9951 1.7342 2.0512 1.7116 3.8051 1.5940 4.3226 1.1420 4.4275 2.3248 5.1890 4.4605 7.8065 5.4728 6.6319 4.3598 6.2933 3.6047 1.0758 3.7944 5.2759 5.6108 3.0935 2.5207 3.6000 3.9383 3.4612 2.5693 2.4216 3.6300 2.0311 3.2675 1.2221 1.2347 1.2610 9.2711 1.3591 1.5227 4.2315 1.4530 2.6417 1.5543 1.2495 5.3275 1.1936 1.2616 1.4969 1.2740 1.5107 7.1122 1.0859 5.9753 2.1863 1.7373 5.0212 1.5359 1.0660 1.0869 1.0866 1.0871 1.0982 1.0880 1.0729 1.0645 1.0456 1.0656 1.0669 1.0855 1.1049
irintensity: 2.6831 0.7933 0.0912 9.3258 0.1623 7.6751 11.5168 1.7968 1.6457 0.8563 4.1271 5.2196 20.1606 20.6168 11.4915 12.3402 5.7474 32.5417 3.1493 23.7397 11.2188 1.7887 129.6513 20.6517 2.0521 6.8950 69.2394 64.8292 37.5006 143.5237 9.6020 186.4224 25.3723 1.0237 9.4798 41.5728 60.2917 50.0966 5.9539 13.3503 153.7146 13.0892 175.2667 103.7398 57.0755 60.1647 100.5612 62.7200 56.9723 31.0852 18.5521 0.4591 3.3252 31.5190 6.2976 1.5828 26.3041 38.6916 8.8921 13.8095 33.2895 13.5198 84.4439 57.2609 25.7404 7.2324 3.3383 20.5718 20.1926 59.9201 39.8200 20.2170 11.3485 102.7014 4.4062 68.0906 188.9021 463.1464 227.7474 67.1924 33.3929 37.6801 2.5988 15.4194 32.4064 3.3758 495.0732 69.1243 61.2288 8.3533 26.4641 81.8662 70.4643
temp: 298.150 k
press: 1.00000 atm
elementType: 8 8 8 8 8 8 7 7 7 7 7 6 6 6 6 6 6 6 6 6 1 1 1 1 1 1 1 1 1 1 1 1 1
symmnumber: 1
zpe: 644371.0 jmol-1
zpe.correction: 0.245428 hartree
zpe.thermalcorrener: 0.264422 hartree
zpe.thermalcorrenthalpy: 0.265366 hartree
zpe.thermalcorrgfe: 0.196885 hartree
zpe.sumelectzpe: -1074.319391 hartree
zpe.sumelectthermal: -1074.300397 hartree
zpe.sumelectthermalent: -1074.299453 hartree
zpe.sumelectthermalfe: -1074.367934 hartree
dipole: -1.5051 -3.0438 -2.0283
dipole: 3.9552
quadrupole: -109.9760 -116.7851 -121.7017
quadrupole: 15.5909 -15.1081 -8.2951
quadrupole: 6.1782 -0.6308 -5.5474 15.5909 -15.1081 -8.2951
hfenergy: -1074.5648187 hartree
pointgroup: C01 [X(C9H13N5O6)]
dipole: -0.8360892 1.2970328 0.2002361 debye
polarizability: 193.7353722|11.4277321|140.7451353|17.646843|-24.1893477|121.3591913 unknown
InChI: InChI=1S/C9H13N5O6/c10-7(18)3-4(8(11)19)13-14(12-3)9-6(17)5(16)2(1-15)20-9/h2,5-6,9,15-17H,1,10-11H2
charge 0 multiplicity 1
33 atoms
O  2.208421 0.770752 -1.20173
O  4.259115 0.58118 1.720976
O  2.932567 2.775045 1.006391
O  3.298398 -1.67876 -2.234676
O  -4.299829 -0.607983 -0.586758
O  -0.925745 -2.616038 2.002507
N  0.046349 0.781783 -0.120473
N  -1.098918 1.130929 -0.774902
N  -0.040628 -0.342494 0.660104
N  -3.632952 1.285221 -1.753008
N  -3.069977 -2.372042 1.107714
C  2.967279 0.300245 1.073325
C  2.086421 1.595734 1.054552
C  3.229651 -0.01014 -0.416959
C  1.335958 1.495088 -0.291216
C  3.086636 -1.486743 -0.800115
C  -1.998567 0.165782 -0.37977
C  -1.340809 -0.755079 0.514471
C  -3.395636 0.236682 -0.902613
C  -1.761045 -1.997381 1.274067
H  2.424045 -0.519625 1.574675
H  1.392982 1.648188 1.914204
H  4.217183 0.37795 -0.721999
H  1.102395 2.477792 -0.72548
H  2.092321 -1.862198 -0.480046
H  3.874291 -2.078982 -0.303403
H  3.833306 2.487041 1.331589
H  4.238983 0.286705 2.665012
H  2.667073 -1.080412 -2.711912
H  -2.88265 1.937784 -1.984406
H  -4.564469 1.395839 -2.150834
H  -3.718269 -1.831599 0.498648
H  -3.380578 -3.207066 1.604466
