program: Gaussian 09
title: 000129851
version: EM64L-G09RevD.01
frameworkgroup: C1[X(C12H10F4N2O2)]
method: RPBEPBE
basis: SDD
operation: Freq
keyword: #p
keyword: freq=noraman
keyword: PBEPBE/SDD
title: #p freq=noraman PBEPBE/SDD
converged: YES YES NO YES
title: Mulliken charges:
elementType: F F F F O O N N C C C C C C C C C C C C H H H H H H H H H H
charge: -0.170403 -0.161558 -0.155466 -0.154002 -0.202935 -0.241878 -0.339628 -0.414344 0.159527 0.145334 -0.671159 -0.672059 0.210523 0.506870 -0.470223 -0.320571 0.142296 -0.358437 0.251527 0.278910 0.332831 0.234027 0.221828 0.252170 0.234533 0.251209 0.221449 0.320651 0.301193 0.267783
chargesum: 0.00000
title: Mulliken charges with hydrogens summed into heavy atoms:
elementType: F F F F O O N N C C C C C C C C C C C C
charge: -0.170403 -0.161558 -0.155466 -0.154002 -0.202935 -0.241878 -0.339628 -0.081514 0.159527 0.145334 0.036866 0.035133 0.210523 0.506870 -0.149571 -0.019378 0.142296 -0.090654 0.251527 0.278910
polarizability: 2.06449503e+02 1.52416520e+01 1.59642972e+02 2.12257928e+00 -9.72843300e-01 8.85922291e+01
1716.lowfreq: -7.1806 -4.2918 -0.0004 0.0005 0.0011 2.6966 17.9891 32.9290 46.4101
frequency: 17.9492 32.9222 46.4015 80.7408 94.1708 113.3944 118.2958 173.3577 189.5821 197.3306 215.6370 233.2780 236.4938 256.3820 295.5810 310.4783 314.5080 322.9066 364.3378 395.0363 423.8956 427.1975 436.4022 442.5140 497.2142 501.8704 527.9646 566.7927 595.7087 608.7630 620.9691 646.4048 648.8475 692.6715 716.9254 725.8963 733.7722 800.5861 830.8314 861.2628 906.8085 929.5437 936.9620 958.1121 968.8797 1002.1002 1004.9370 1006.5791 1012.7334 1057.6274 1100.2279 1137.0324 1171.5150 1204.4564 1207.0786 1214.4815 1254.1548 1266.5788 1299.6453 1349.4841 1366.4075 1377.5346 1384.3244 1401.1811 1428.3839 1458.4054 1462.6537 1478.1807 1484.6313 1495.0261 1598.4508 1625.0496 1647.5208 1715.0515 2991.5895 2993.5702 3091.0377 3095.3475 3105.6550 3110.4021 3178.2906 3203.5581 3205.1632 3601.8214
redmass: 7.7520 8.8448 5.8291 7.9039 5.4370 6.2717 8.4360 7.9100 6.1128 1.0312 5.4213 4.4730 1.3972 4.6108 4.4826 3.8416 7.0502 4.7055 7.8105 5.9314 6.5230 5.3166 4.5026 6.4726 1.2468 3.9240 7.6992 6.1152 6.9672 5.9152 7.7433 3.8919 7.8722 9.2628 8.6935 4.4517 7.1362 7.1705 1.4878 5.3214 1.5273 2.3610 1.5155 1.3568 2.1234 11.0053 1.3429 4.7148 6.8510 4.7782 3.8179 1.7034 4.0408 2.2136 3.3907 2.4112 3.3625 2.0877 2.4727 6.2061 1.6803 1.1865 10.9863 1.2846 4.4493 1.0458 1.0488 1.0697 1.0665 3.0615 7.9181 6.8850 10.6603 10.2275 1.0349 1.0353 1.1010 1.1004 1.1011 1.1005 1.0911 1.0943 1.0941 1.0799
irintensity: 0.1479 0.2318 2.3988 0.8895 0.4138 0.7519 1.4361 0.9441 1.6729 0.0878 3.3825 0.2372 1.6602 1.1578 4.6948 1.6928 1.0326 6.0916 5.1845 4.2986 13.8234 0.0890 1.8491 2.0455 106.0065 36.5061 14.6098 38.0258 20.4884 8.6458 10.2912 4.6391 14.3979 9.8307 17.7796 1.6754 3.4213 7.2043 41.5213 22.9286 45.7551 5.6458 2.4192 3.1213 4.7252 226.4114 4.0417 93.8855 193.9726 30.2624 39.6659 56.5751 13.1968 5.3226 90.0905 106.8625 204.0837 96.0339 52.9068 305.5490 10.3256 17.5677 24.6589 20.2637 119.9752 6.6615 2.4019 10.2232 16.1329 258.3027 18.2360 19.7878 386.9883 223.0258 14.1448 22.5249 7.8560 34.3985 7.0772 16.8726 0.4672 6.0458 7.4745 67.3453
temp: 298.150 k
press: 1.00000 atm
elementType: 9 9 9 9 8 8 7 7 6 6 6 6 6 6 6 6 6 6 6 6 1 1 1 1 1 1 1 1 1 1
symmnumber: 1
zpe: 543125.2 jmol-1
zpe.correction: 0.206865 hartree
zpe.thermalcorrener: 0.225271 hartree
zpe.thermalcorrenthalpy: 0.226215 hartree
zpe.thermalcorrgfe: 0.159165 hartree
zpe.sumelectzpe: -1121.187750 hartree
zpe.sumelectthermal: -1121.169344 hartree
zpe.sumelectthermalent: -1121.168400 hartree
zpe.sumelectthermalfe: -1121.235450 hartree
dipole: -7.9390 0.9996 0.2589
dipole: 8.0058
quadrupole: -104.1429 -121.3456 -114.7342
quadrupole: 10.5844 0.5109 5.9292
quadrupole: 9.2646 -7.9381 -1.3266 10.5844 0.5109 5.9292
hfenergy: -1121.3946151 hartree
pointgroup: C01 [X(C12H10F4N2O2)]
dipole: 3.1231246 0.3982477 -0.0911433 debye
polarizability: 206.4815161|-15.1793226|159.5915281|2.4506336|1.1056048|88.6116593 unknown
InChI: InChI=1S/C12H10F4N2O2/c1-11(2)9(19)18(10(20)17-11)6-3-4-8(13)7(5-6)12(14,15)16/h3-5,17H,1-2H3
charge 0 multiplicity 1
30 atoms
F  -4.026256 1.523809 -0.314458
F  -2.640426 -2.450804 0.384877
F  -4.14759 -0.979149 1.218189
F  -4.054324 -1.363926 -1.013257
O  1.508682 -1.927581 -0.599667
O  2.303986 2.560864 0.706594
N  1.488251 0.385028 0.015624
N  3.709512 0.693632 0.346856
C  3.613406 -0.725608 -0.044212
C  2.086366 -0.870335 -0.252273
C  4.351639 -1.022408 -1.373187
C  4.081938 -1.678182 1.083974
C  2.505429 1.363074 0.39756
C  0.084225 0.678166 -0.062696
C  -0.859916 -0.368697 0.080455
C  -0.360472 2.00727 -0.28975
C  -2.240689 -0.093597 -0.004955
C  -1.738929 2.284397 -0.365837
C  -2.658504 1.236609 -0.226463
C  -3.250177 -1.199114 0.14251
H  4.579043 1.168251 0.583613
H  4.045867 -0.316516 -2.164339
H  5.444106 -0.941434 -1.229514
H  4.114393 -2.047507 -1.704139
H  3.578219 -1.444202 2.037608
H  3.847799 -2.72006 0.807509
H  5.17354 -1.588924 1.229805
H  -0.527846 -1.396048 0.234232
H  0.363623 2.818095 -0.379298
H  -2.102396 3.301296 -0.53506
