program: Gaussian 09
title: 000129832
version: EM64L-G09RevD.01
frameworkgroup: C1[X(C11H13N2)]
method: RPBEPBE
basis: SDD
operation: Freq
keyword: #p
keyword: freq=noraman
keyword: PBEPBE/SDD
title: #p freq=noraman PBEPBE/SDD
converged: NO YES NO NO
title: Mulliken charges:
elementType: N N C C C C C C C C C C C H H H H H H H H H H H H H
charge: -0.189570 -0.645134 0.216477 0.276660 0.364364 0.418852 -0.471332 -0.316255 -0.320476 -0.666696 -0.797615 -0.221232 -0.258509 0.252493 0.274239 0.272522 0.282556 0.272551 0.215177 0.268182 0.265016 0.268139 0.264556 0.266139 0.354447 0.354451
chargesum: 1.00000
title: Mulliken charges with hydrogens summed into heavy atoms:
elementType: N N C C C C C C C C C C C
charge: -0.189570 0.063763 0.216477 0.276660 0.364364 0.418852 -0.218839 -0.042016 -0.105299 0.160933 0.003722 0.043323 0.007629
polarizability: 1.78591697e+02 -2.64923586e+00 1.62208592e+02 5.69177401e-03 1.17873320e-02 5.95553816e+01
1716.lowfreq: -8.5886 -0.0009 -0.0008 0.0002 6.2223 15.2410 73.6167 108.3032 159.3386
frequency: 73.4522 108.3017 159.3382 200.5220 219.6267 260.2712 290.5568 321.3955 345.4082 395.1269 411.1670 423.6488 474.4756 496.1136 520.2754 520.6229 568.7206 601.2987 628.0510 636.2494 660.7598 698.8213 761.1887 780.4797 789.0951 861.7668 868.2706 888.6979 964.4874 1008.2388 1009.0045 1047.1494 1049.0189 1057.3877 1088.4961 1117.6304 1130.0550 1147.7638 1186.1055 1200.5885 1236.2633 1287.0790 1306.7344 1383.8119 1404.5638 1409.9308 1427.5903 1444.9075 1462.7526 1468.0632 1469.2536 1491.0438 1501.4638 1512.4420 1545.6274 1563.8410 1623.0819 1626.9802 1668.3382 2993.2560 3015.1400 3073.0230 3101.0316 3118.4567 3140.2710 3161.0091 3173.6732 3175.8475 3180.6503 3196.3478 3539.4960 3670.8068
redmass: 2.9720 2.6043 3.4564 1.1598 3.3729 1.1238 3.7190 2.9372 3.0248 2.7571 2.1486 5.7693 5.6538 1.4210 2.3786 5.8429 2.9860 1.9883 1.9010 5.2138 2.7778 4.9275 2.1307 1.7815 4.3733 1.4151 1.6058 3.4699 1.3671 1.6398 1.3594 2.1733 1.5551 1.9633 2.3866 1.3277 1.7367 3.5535 1.7312 1.0905 2.1508 1.7330 1.8839 2.7176 4.9302 1.4252 1.8225 1.2528 1.6215 1.0423 2.0157 1.4707 1.0405 1.7230 4.1600 5.2235 5.8850 4.8912 1.3101 1.0399 1.0385 1.0982 1.1033 1.0974 1.0890 1.0903 1.0962 1.0930 1.0969 1.0961 1.0472 1.1030
irintensity: 1.0890 0.0000 14.2012 0.0759 0.7362 0.2065 0.1751 2.5503 0.2289 0.6023 3.4040 1.3201 2.3773 8.3037 3.3019 0.6799 0.2734 38.1479 143.8136 0.1498 55.9931 2.4406 53.8716 60.5276 1.4931 33.4789 3.5659 9.4439 0.8134 0.9866 0.0655 5.6266 8.8220 6.3716 2.7124 0.1925 7.9073 13.3063 22.3415 0.8939 0.2878 3.6064 2.1895 33.6961 26.0736 14.9823 16.1219 43.4592 24.4871 40.8531 10.0818 19.6353 1.3863 44.8003 22.5947 74.2618 48.4317 205.6251 372.7423 1.0842 13.1404 2.7823 4.8953 6.5018 4.6459 1.9075 4.0923 1.3157 3.5766 1.1106 167.5699 44.3570
temp: 298.150 k
press: 1.00000 atm
elementType: 7 7 6 6 6 6 6 6 6 6 6 6 6 1 1 1 1 1 1 1 1 1 1 1 1 1
symmnumber: 1
zpe: 576255.6 jmol-1
zpe.correction: 0.219484 hartree
zpe.thermalcorrener: 0.230747 hartree
zpe.thermalcorrenthalpy: 0.231691 hartree
zpe.thermalcorrgfe: 0.183194 hartree
zpe.sumelectzpe: -535.353564 hartree
zpe.sumelectthermal: -535.342302 hartree
zpe.sumelectthermalent: -535.341357 hartree
zpe.sumelectthermalfe: -535.389854 hartree
dipole: -1.4959 1.4804 0.0015
dipole: 2.1046
quadrupole: -41.4657 -37.8319 -79.6001
quadrupole: 3.1555 -0.0010 0.0027
quadrupole: 11.5002 15.1340 -26.6342 3.1555 -0.0010 0.0027
hfenergy: -535.5730483 hartree
pointgroup: C01 [X(C11H13N2)]
dipole: -0.6294022 0.5380233 0.0005847 debye
dipolederiv: -0.6748036 0.1907515 -0.0000773 -0.0052481 -0.7270854 -0.000058 0.0000243 0.0009394 -0.0967245 -0.2612354 -0.3379065 0.000132 -0.1831831 -1.5024628 -0.0002074 0.0000999 -0.0000826 -0.5867597 0.5456468 0.0698183 -0.0002811 -0.1585629 0.0802877 0.0002405 -0.0004428 -0.0000041 0.0790567 -0.1467753 0.3017953 0.0001712 0.1878927 -0.4403644 -0.0001117 0.0001565 -0.0000793 0.007889 0.6722384 -0.1558329 0.0003229 0.2291348 1.0127044 -0.0000865 -0.0001225 -0.0005128 0.0653959 0.7247039 0.4937205 0.0001027 0.0587367 1.6579855 0.0003654 0.0002931 0.0005779 0.2059822 -0.5266514 -0.6967229 -0.0000487 -0.3582433 -0.5914173 -0.0000803 -0.0000488 -0.0002137 -0.2106751 -0.3089571 -0.0185526 0.0000958 0.0979271 0.0804638 0.0001688 0.0001764 0.0002559 -0.150171 0.0304101 -0.134771 -0.000048 0.0908835 0.0921804 0.0000733 0.0000555 -0.0000228 -0.1181246 0.0826067 0.1006863 -0.0000232 0.1293588 0.4260295 0.0001489 -0.0001305 -0.0000598 0.1640678 -0.2488054 -0.0417214 0.000052 -0.1840424 -0.0083267 -0.0000158 0.0010797 0.0001913 0.0246464 0.0808561 0.0011084 -0.0001113 -0.1303473 0.2429357 0.0001568 -0.0001627 0.0001979 -0.0932856 0.1281371 0.1259921 0.0000382 0.1465553 -0.2477045 -0.0000162 0.0001029 -0.0001149 -0.1093522 0.0193345 0.0488857 -0.0001083 0.0537956 0.0200154 0.0000277 -0.0002171 -0.0000849 0.1721394 0.0925431 -0.0693169 -0.0000642 -0.038051 -0.0045408 -0.0001126 -0.0000148 -0.0001786 0.1620917 0.0967957 0.0614669 -0.0790793 -0.0165727 0.0072703 0.0161078 -0.053312 0.0523444 -0.0027096 -0.0478135 -0.0591004 0.000608 0.0236272 0.1164129 -0.0002789 0.0004224 -0.0001664 0.1233178 0.0974184 0.0608543 0.0783611 -0.0168284 0.0068234 -0.01625 0.0528379 -0.0527282 -0.0033806 0.0933854 0.00918 -0.0000002 -0.0549815 -0.0822198 -0.0000678 -0.0000574 -0.0000461 0.1495486 0.0593684 -0.0100944 -0.0141632 -0.0199393 0.063276 0.088056 0.0129647 0.0820633 0.0122653 0.0860083 0.0202814 -0.0001402 0.1211953 -0.0401351 0.0005248 -0.000428 0.000313 0.1312146 0.059404 -0.0098472 0.0143915 -0.0196763 0.0624645 -0.0884523 -0.0131403 -0.0824453 0.0129689 0.0462857 0.0638169 0.0000509 0.0650787 0.0297982 -0.0000903 0.0000336 -0.0000596 0.1597858 -0.023205 -0.0300656 -0.0000052 -0.0336519 0.0910841 -0.0000304 0.0000172 -0.0000214 0.1676158 0.1744326 0.0910966 -0.0000788 0.0213917 0.308401 0.0000128 -0.0000849 0.0000363 0.3593494 0.1486717 -0.0755224 -0.0000974 -0.0062491 0.346124 -0.0000247 -0.0001024 -0.000099 0.3738476 unknown
polarizability: 178.8897152|-1.4307966|161.9105739|0.004818|0.0121707|59.5553816 unknown
InChI: InChI=1S/C11H13N2/c1-8-7-10(12)9-5-3-4-6-11(9)13(8)2/h3-7H,12H2,1-2H3
charge 1 multiplicity 1
26 atoms
N  -1.085023 -1.015741 0.000229
N  0.019868 3.051353 0.00022
C  0.294272 -0.689427 -0.000133
C  0.713826 0.688583 0.000033
C  -2.04971 -0.022088 -0.000756
C  -0.303899 1.727151 -0.000109
C  -1.665142 1.325604 -0.000859
C  1.280461 -1.718234 -0.000837
C  2.110365 0.982972 0.000085
C  -1.460332 -2.455579 0.001502
C  -3.515827 -0.384604 -0.001251
C  2.643308 -1.393719 -0.000894
C  3.066773 -0.036337 -0.00026
H  -2.45528 2.080045 -0.001448
H  0.993302 -2.770967 -0.001666
H  -1.060525 -2.952591 0.901226
H  -2.550289 -2.562982 0.004794
H  -1.06539 -2.953276 -0.900043
H  2.459442 2.02135 0.000345
H  -3.801062 -0.967227 0.893887
H  -4.122495 0.533402 -0.004164
H  -3.799437 -0.971944 -0.893759
H  3.386278 -2.197304 -0.001484
H  4.132893 0.207366 -0.000195
H  0.983879 3.377822 0.000773
H  -0.709154 3.764073 0.000162
