program: Gaussian 09
title: 000129862
version: EM64L-G09RevD.01
frameworkgroup: C1[X(C10H14N6O4S)]
method: RPBEPBE
basis: SDD
operation: Freq
keyword: #p
keyword: freq=noraman
keyword: PBEPBE/SDD
title: #p freq=noraman PBEPBE/SDD
converged: YES YES NO NO
title: Mulliken charges:
elementType: S O O O O N N N N N N C C C C C C C C C C H H H H H H H H H H H H H H
charge: 0.399167 -0.293494 -0.425125 -0.487078 -0.432477 -0.187563 -0.050655 -0.074031 -0.050904 -0.588028 -0.778096 -0.169112 -0.048664 -0.185561 -0.077782 -0.319510 0.209097 -0.213081 0.101252 -0.422385 -0.032992 0.269849 0.277162 0.240730 0.253710 0.184863 0.217260 0.372431 0.366932 0.266564 0.363512 0.331482 0.329340 0.326476 0.326712
chargesum: 0.00000
title: Mulliken charges with hydrogens summed into heavy atoms:
elementType: S O O O O N N N N N N C C C C C C C C C C
charge: 0.399167 -0.293494 -0.052694 -0.120146 -0.068966 -0.187563 -0.050655 -0.074031 -0.050904 0.072794 -0.124909 0.100737 0.228498 0.055169 0.175927 0.082614 0.209097 0.053483 0.101252 -0.422385 -0.032992
polarizability: 2.70432092e+02 -5.69654041e+00 1.84300895e+02 4.76717352e+00 -2.32252534e+01 1.15592190e+02
1716.lowfreq: -9.0057 -4.3257 -0.0004 0.0008 0.0011 4.3571 20.2059 20.9247 38.7825
frequency: 19.8577 20.7435 38.7221 57.1645 72.7085 92.8013 103.0888 117.8379 134.7940 153.6028 164.9077 196.5672 218.2038 228.9873 258.3426 270.3300 273.6682 290.6379 309.3102 326.8209 344.1188 366.0482 400.8793 419.7154 448.0943 480.7348 499.3176 504.6259 511.1600 513.8572 523.9908 549.6038 600.6714 605.1792 613.1224 644.6853 645.8599 691.6271 714.8334 775.7516 782.5905 807.5385 815.0091 821.9233 857.0660 866.2646 880.7091 926.3929 958.1566 962.7771 974.1928 1006.3210 1034.7219 1042.2559 1055.1778 1059.1357 1083.2079 1106.9625 1108.6385 1153.0427 1169.3465 1177.9759 1215.2915 1225.0063 1242.9412 1250.1137 1267.1033 1285.5168 1295.1910 1312.3972 1319.7231 1334.0512 1341.1427 1358.3769 1369.1940 1383.9471 1386.3374 1403.3145 1439.9259 1462.1438 1497.3311 1520.5648 1575.7969 1607.8381 1614.6303 2935.3020 3011.8651 3021.9462 3026.7676 3059.1182 3064.0680 3236.4507 3425.9482 3483.7626 3529.4751 3566.4447 3566.6880 3610.0745 3724.9712
redmass: 7.1761 6.2942 6.2905 5.4866 4.2009 5.9216 3.1637 6.9919 5.6737 4.3978 4.8512 5.7382 5.5132 1.2098 5.2945 4.3386 1.5046 3.6623 4.1456 3.7969 4.8708 6.4495 9.2410 4.8074 1.2132 1.1827 1.2096 5.8124 1.0937 2.8407 2.7243 6.2006 6.3686 5.3257 6.2492 5.9365 4.5204 4.6217 11.6275 7.7071 3.2745 2.9758 2.6616 5.2665 2.7949 3.0051 4.1921 5.9849 3.0660 5.0433 2.8786 3.4421 2.2965 2.3700 3.1002 3.9214 3.1541 3.0805 1.1045 1.4275 2.6848 1.1981 2.0008 1.4952 1.3775 1.2574 1.3591 1.9114 2.1221 1.7590 3.7773 1.2612 4.8854 1.4405 1.4603 1.8798 1.8169 1.5162 4.7074 1.0917 3.1578 9.5064 9.9048 1.5404 1.0840 1.0691 1.0869 1.0853 1.0864 1.0870 1.0942 1.0979 1.0427 1.0645 1.0655 1.0442 1.0997 1.0671 1.1059
irintensity: 0.0105 0.8006 0.5830 4.7971 4.0165 3.6199 4.7848 6.0367 2.2608 0.3003 2.9473 4.6254 3.3823 143.0595 14.6741 4.9378 50.1467 22.7187 7.0924 17.8657 16.5457 11.6587 3.7285 3.9906 290.0274 157.0304 163.4866 15.9581 11.5953 142.2667 3.8671 7.6636 9.4711 27.2718 2.6026 0.9521 14.4696 45.2756 10.3468 9.6106 18.2651 25.3418 9.6727 30.0620 3.2487 93.3341 111.6495 203.1410 36.3608 38.5614 33.4816 97.3874 11.9935 39.6536 61.9333 32.8799 47.7368 12.0646 1.6000 8.1329 54.4033 23.7785 136.3116 36.8599 6.4050 9.8480 13.5396 6.4857 7.5937 66.3951 4.8787 7.4072 26.1794 15.3460 30.3986 146.1379 68.9729 16.8923 107.5701 8.7526 147.2039 266.1146 258.4092 459.4871 12.9725 59.1410 33.3950 25.6090 7.9304 17.7129 53.5742 0.1167 10.8958 42.8052 14.6621 127.2202 9.6777 23.2569 44.6221
temp: 298.150 k
press: 1.00000 atm
elementType: 16 8 8 8 8 7 7 7 7 7 7 6 6 6 6 6 6 6 6 6 6 1 1 1 1 1 1 1 1 1 1 1 1 1 1
symmnumber: 1
zpe: 680813.6 jmol-1
zpe.correction: 0.259308 hartree
zpe.thermalcorrener: 0.280041 hartree
zpe.thermalcorrenthalpy: 0.280985 hartree
zpe.thermalcorrgfe: 0.208086 hartree
zpe.sumelectzpe: -1415.307517 hartree
zpe.sumelectthermal: -1415.286785 hartree
zpe.sumelectthermalent: -1415.285840 hartree
zpe.sumelectthermalfe: -1415.358739 hartree
dipole: 5.0226 5.8985 -1.0719
dipole: 7.8210
quadrupole: -108.5326 -129.0890 -137.4185
quadrupole: -7.7488 15.5764 -9.8232
quadrupole: 16.4808 -4.0757 -12.4051 -7.7488 15.5764 -9.8232
hfenergy: -1415.5668254 hartree
pointgroup: C01 [X(C10H14N6O4S1)]
dipole: 1.807868 2.4254653 -0.5627754 debye
polarizability: 270.6821187|1.2219795|180.7306038|7.6929314|-26.9924731|118.9124538 unknown
InChI: InChI=1S/C10H14N6O4S/c11-10-14-7-4(8(15-10)21-12)13-2-16(7)9-6(19)5(18)3(1-17)20-9/h2-3,5-6,9,17-19H,1,11-12H2
charge 0 multiplicity 1
35 atoms
S  -4.581162 -1.910123 0.632992
O  2.309871 -0.388098 -0.878325
O  1.949126 1.817652 2.071156
O  3.779679 2.272071 0.218559
O  4.183196 -2.400482 -1.377423
N  0.233653 -0.296505 0.294883
N  -1.207211 -1.962595 0.956858
N  -1.399719 1.306276 -0.643895
N  -3.713587 0.47996 -0.452235
N  -3.227204 2.556636 -1.424802
N  -6.098674 -1.139004 0.113561
C  2.360438 0.685339 1.278929
C  1.460826 0.42357 0.032858
C  3.762476 0.858197 0.634178
C  3.750878 -0.115879 -0.562659
C  4.404237 -1.477001 -0.27045
C  -1.051202 0.143392 -0.046397
C  0.070925 -1.570926 0.889343
C  -1.932259 -0.898376 0.379492
C  -3.308736 -0.665621 0.142199
C  -2.757765 1.41262 -0.821459
H  2.345553 -0.189028 1.951483
H  1.181606 1.378951 -0.450136
H  4.583419 0.649883 1.347127
H  4.203548 0.336313 -1.46503
H  4.006812 -1.890635 0.683754
H  5.500155 -1.373003 -0.183834
H  2.294265 2.630388 1.609345
H  4.677304 2.537917 -0.095458
H  0.918356 -2.164906 1.22289
H  3.212517 -2.38393 -1.588767
H  -2.566588 3.27292 -1.712281
H  -4.226328 2.666261 -1.569926
H  -6.13587 -1.005559 -0.904929
H  -6.280434 -0.262575 0.618797
