program: Gaussian 09
title: 000129973
version: EM64L-G09RevD.01
frameworkgroup: C1[X(C17H14O6)]
method: RPBEPBE
basis: SDD
operation: Freq
keyword: #pfreq=noraman
keyword: PBEPBE/SDD
title: #p freq=noraman PBEPBE/SDD
converged: YES YES NO NO
title: Mulliken charges:
elementType: O O O O O O C C C C C C C C C C C C C C C C C H H H H H H H H H H H H H H
charge: -0.273864 -0.282985 -0.278259 -0.380286 -0.232367 -0.422952 0.214641 0.237629 0.088075 0.067587 -0.511892 0.019705 -0.522971 0.311189 0.224900 0.231928 -0.351206 -0.415843 -0.379223 -0.344942 0.283495 -0.535004 -0.514990 0.294232 0.284748 0.261084 0.293734 0.226633 0.260337 0.365334 0.242558 0.231130 0.235944 0.215866 0.263540 0.232265 0.360229
chargesum: 0.00000
title: Mulliken charges with hydrogens summed into heavy atoms:
elementType: O O O O O O C C C C C C C C C C C C C C C C C
charge: -0.273864 -0.282985 -0.278259 -0.014952 -0.232367 -0.062723 0.214641 0.237629 0.088075 0.067587 -0.217660 0.019705 -0.238223 0.311189 0.224900 0.231928 -0.090122 -0.122109 -0.152590 -0.084604 0.283495 0.174629 0.196681
polarizability: 3.89710448e+02 1.24133135e+01 2.28763640e+02 -2.57332149e+00 1.28870408e+01 1.04518191e+02
1716.lowfreq: -2.9658 -0.4463 -0.0006 -0.0003 0.0002 6.6942 30.1996 39.4197 44.9686
frequency: 30.1971 39.4155 44.9632 58.1677 74.3279 80.1357 107.8165 131.0564 151.6760 162.8708 175.3133 194.9495 220.2732 233.1340 259.5669 269.9957 305.2171 319.2084 326.5910 333.9075 365.2702 371.3703 378.6856 394.4988 399.9852 438.5850 448.3268 453.8322 471.0136 504.1091 526.0297 544.8963 575.8447 595.8391 633.1267 636.0905 643.1264 682.0319 710.9660 723.7942 730.3241 746.7343 774.4584 794.3276 817.3992 844.9194 847.1187 868.6039 899.5541 920.6306 948.8179 973.8465 978.5338 989.0981 1003.7257 1056.1720 1106.1793 1111.0661 1113.8027 1123.8656 1141.1981 1145.3867 1152.7910 1161.3538 1170.9548 1184.1992 1207.3095 1232.9895 1255.4630 1279.9864 1289.8936 1312.9658 1372.3106 1389.4962 1395.8912 1414.8832 1431.3903 1433.6984 1451.7630 1454.3488 1466.2453 1473.7214 1477.2429 1490.8156 1496.2392 1549.0032 1559.4900 1581.6720 1591.8025 1622.5681 1625.8269 2971.1834 2984.7744 3063.6421 3097.0364 3121.5492 3130.0158 3136.4405 3136.8870 3161.5253 3168.3966 3174.8968 3184.0976 3511.2345 3579.8657
redmass: 5.3722 2.5190 3.0660 4.0158 6.1630 3.6469 4.3817 2.9317 3.2247 4.7143 3.9088 3.9285 5.2398 3.6255 1.6646 3.7489 6.0632 5.8430 5.4555 5.9617 5.3173 6.0471 1.1621 2.1466 4.0703 6.4620 2.4203 2.5164 3.6584 4.3403 4.5063 7.4585 6.3068 6.0128 7.0632 6.9402 7.0943 5.3128 6.5105 4.1178 3.9922 6.4852 6.7898 6.2291 1.3823 5.8118 1.4884 1.5873 1.4269 7.0418 1.3781 5.5582 1.4656 3.8562 2.8095 4.3000 1.7152 1.2372 1.2582 2.5024 1.9069 1.3265 1.4783 1.9734 2.7200 1.1313 3.4902 1.3048 2.3561 3.8296 4.7352 1.4413 3.0301 5.1072 6.0572 2.4388 1.3397 3.2392 1.7703 1.0867 1.0491 1.2085 1.0570 2.4318 2.8898 10.3191 9.8427 6.6423 9.4038 6.8604 6.8557 1.0321 1.0344 1.1044 1.0974 1.0901 1.1008 1.0900 1.1055 1.0905 1.0945 1.0957 1.0926 1.0654 1.0661
irintensity: 1.5666 4.2421 0.5948 2.7200 4.2906 0.5608 3.2437 0.8371 7.8538 4.5044 2.5158 3.2117 2.3397 4.8873 0.3124 1.9192 1.7600 7.8895 1.3442 12.2472 4.6593 5.2992 157.3330 22.2501 8.9695 1.6228 58.7674 44.9609 4.0596 6.3656 14.6017 9.8847 14.2552 3.2474 2.8277 13.5408 3.5156 1.1190 3.6952 3.4969 19.2400 79.7453 10.6590 8.2268 34.5758 14.5312 34.8489 21.9393 32.0009 11.7840 0.8219 29.2477 17.7652 49.5790 3.1959 39.0480 197.3881 15.5976 0.1109 172.2702 109.7866 274.1089 14.3084 180.9744 50.7797 36.4553 49.1641 0.8807 36.7080 43.6681 319.4525 3.9709 58.0354 2.9831 130.1965 53.8955 15.4271 14.9932 31.7681 29.3699 14.4849 157.9077 34.0874 121.3173 133.0935 160.2089 153.3376 54.4791 57.1994 93.4987 60.7813 52.9718 95.6692 36.5098 39.0873 21.7855 25.1243 1.8904 13.2539 7.6076 3.9431 3.9922 0.6503 37.2598 78.7156
temp: 298.150 k
press: 1.00000 atm
elementType: 8 8 8 8 8 8 6 6 6 6 6 6 6 6 6 6 6 6 6 6 6 6 6 1 1 1 1 1 1 1 1 1 1 1 1 1 1
symmnumber: 1
zpe: 717160.2 jmol-1
zpe.correction: 0.273152 hartree
zpe.thermalcorrener: 0.294068 hartree
zpe.thermalcorrenthalpy: 0.295013 hartree
zpe.thermalcorrgfe: 0.222915 hartree
zpe.sumelectzpe: -1105.864207 hartree
zpe.sumelectthermal: -1105.843290 hartree
zpe.sumelectthermalent: -1105.842346 hartree
zpe.sumelectthermalfe: -1105.914444 hartree
dipole: -0.1932 -4.6187 -0.2059
dipole: 4.6273
quadrupole: -90.0388 -141.1850 -132.2450
quadrupole: 12.5713 11.8107 1.7913
quadrupole: 31.1175 -20.0287 -11.0887 12.5713 11.8107 1.7913
hfenergy: -1106.1373587 hartree
pointgroup: C01 [X(C17H14O6)]
dipole: 0.1467652 1.7837301 -0.3332863 debye
polarizability: 390.3590535|6.9302979|222.0228506|3.9463062|-29.5674474|110.6103742 unknown
InChI: InChI=1S/C17H14O6/c1-21-13-7-11-12(8-14(13)22-2)23-17(16(20)15(11)19)9-3-5-10(18)6-4-9/h3-8,18,20H,1-2H3
charge 0 multiplicity 1
37 atoms
O  0.497754 0.738865 -0.193297
O  -5.094655 0.183191 -0.244213
O  -3.815831 2.721437 -0.610028
O  1.677436 -2.783726 0.200353
O  -1.070962 -3.114424 0.355617
O  6.874272 1.117177 -0.033943
C  -1.452345 -0.746198 0.022284
C  -0.891639 0.536703 -0.184271
C  1.353821 -0.365008 -0.005693
C  -0.597243 -1.943379 0.189807
C  -2.866468 -0.86938 0.022431
C  0.852375 -1.655011 0.127178
C  -1.700286 1.676587 -0.359382
C  2.776571 0.023802 -0.023204
C  -3.694494 0.245394 -0.173635
C  -3.100559 1.550253 -0.35082
C  3.222393 1.078518 -0.866217
C  3.730007 -0.616671 0.824207
C  4.575468 1.463561 -0.8897
C  5.084678 -0.240163 0.803887
C  5.511262 0.794972 -0.060818
C  -5.709791 -1.145183 -0.131084
C  -5.026212 3.029054 0.184445
H  -3.26387 -1.879519 0.160143
H  -1.256194 2.66493 -0.49765
H  2.496764 1.59438 -1.501778
H  3.402657 -1.36705 1.552778
H  4.901084 2.277664 -1.549965
H  5.817768 -0.719369 1.458914
H  2.602572 -2.559366 -0.083675
H  -6.790227 -0.970095 -0.237465
H  -5.496425 -1.601921 0.853897
H  -5.354851 -1.815303 -0.936551
H  -4.780406 3.049922 1.26305
H  -5.82254 2.294251 -0.00614
H  -5.325284 4.033261 -0.151435
H  7.081499 1.856043 -0.658728
