program: Gaussian 09
title: 000012057
version: EM64L-G09RevD.01
frameworkgroup: C1[X(C6H6O2S)]
method: RPBEPBE
basis: SDD
operation: Freq
keyword: #pfreq=noraman
keyword: PBEPBE/SDD
title: #p freq=noraman PBEPBE/SDD
converged: YES YES NO NO
title: Mulliken charges:
elementType: S O O C C C C C C H H H H H H
charge: 0.745653 -0.596901 -0.561163 -0.139193 -0.235598 -0.201034 -0.205452 -0.206844 -0.218427 0.295640 0.256543 0.239387 0.236838 0.235564 0.354987
chargesum: 0.00000
title: Mulliken charges with hydrogens summed into heavy atoms:
elementType: S O O C C C C C C
charge: 0.745653 -0.241915 -0.561163 -0.139193 0.060042 0.055509 0.033935 0.029994 0.017137
polarizability: 1.25104770e+02 6.34312672e-01 9.82033022e+01 -6.87115525e-01 1.93863151e+00 4.45025517e+01
1716.lowfreq: -13.5943 -6.0045 -0.0026 -0.0024 -0.0023 0.7330 38.3771 117.9065 171.1692
frequency: 38.3147 117.9043 171.1636 222.5953 266.3765 302.1752 319.3363 401.7802 412.0101 481.0095 520.4757 605.0354 658.3214 691.1898 755.5015 848.8565 870.3489 930.6487 980.1219 983.4308 1004.7420 1010.5169 1028.6630 1047.2883 1076.8553 1171.9724 1178.0984 1300.9528 1386.3344 1432.9496 1453.9902 1582.0667 1599.8549 3130.9832 3137.6899 3148.3273 3160.1281 3171.6633 3484.3774
redmass: 5.2559 5.3394 5.7300 7.1890 2.3479 1.6873 8.6346 2.8681 7.2653 4.6967 9.5917 6.4858 6.8347 2.2775 1.4657 1.2549 16.6304 1.3581 5.8531 1.3929 1.3374 3.9630 1.1115 2.1354 1.5528 1.0612 1.1207 1.3108 9.1085 2.2013 2.0362 5.8696 6.7179 1.0863 1.0883 1.0916 1.0965 1.1014 1.0666
irintensity: 1.0781 3.0579 5.2016 7.3693 29.1131 110.3978 6.7569 0.6274 19.9112 25.3789 68.9781 0.1784 1.5415 38.8132 81.6683 2.0783 53.0012 5.3537 0.8880 2.1765 1.9104 0.9223 63.5582 19.3339 7.5701 0.3532 2.3272 2.4702 4.5111 13.3397 10.0735 0.0652 0.9253 3.4036 3.3210 3.9452 17.1015 24.2052 19.1282
temp: 298.150 k
press: 1.00000 atm
elementType: 16 8 8 6 6 6 6 6 6 1 1 1 1 1 1
symmnumber: 1
zpe: 275643.8 jmol-1
zpe.correction: 0.104987 hartree
zpe.thermalcorrener: 0.113832 hartree
zpe.thermalcorrenthalpy: 0.114776 hartree
zpe.thermalcorrgfe: 0.070503 hartree
zpe.sumelectzpe: -779.988292 hartree
zpe.sumelectthermal: -779.979447 hartree
zpe.sumelectthermalent: -779.978503 hartree
zpe.sumelectthermalfe: -780.022776 hartree
dipole: -2.1535 -2.0862 -1.3372
dipole: 3.2830
quadrupole: -50.1293 -57.3074 -63.1713
quadrupole: -8.0070 -1.7281 2.6139
quadrupole: 6.7400 -0.4381 -6.3020 -8.0070 -1.7281 2.6139
hfenergy: -780.0932789 hartree
pointgroup: C01 [X(C6H6O2S1)]
dipole: -0.8538303 -0.847886 -0.4694171 debye
dipolederiv: 1.1000614 -0.0031911 -0.0479351 0.0994381 0.8350616 -0.3160067 0.0455336 -0.2596588 0.6684544 -0.3321437 0.086927 -0.1406625 0.1460948 -0.7492647 0.0851757 -0.2632871 0.3123123 -0.659196 -0.583815 -0.0465303 0.1121851 -0.270585 -0.5458521 0.2246609 -0.0368934 -0.0901731 -0.3793496 -0.0835284 -0.006893 -0.0226829 -0.0518728 -0.0260908 -0.0184234 0.1595534 0.000735 -0.0958015 -0.1674393 0.1104112 0.0281724 -0.1610894 -0.0688811 -0.0067442 -0.0129937 0.0176433 -0.1062855 -0.1017059 -0.1333972 -0.0236644 0.1620951 0.0236776 0.0347888 0.0650559 -0.0042985 -0.0955165 -0.0626431 -0.1442253 -0.0397464 -0.06374 0.1068011 0.0323953 -0.036266 0.0550803 -0.1394916 -0.0544419 0.1519201 -0.0019464 0.0811726 0.0428598 0.0170625 -0.0198868 0.0004626 -0.1439463 0.1435672 -0.0015303 -0.0356508 -0.0103537 -0.012524 0.0181472 -0.0296707 0.0160774 -0.1307743 0.1332092 -0.0780782 0.0155218 -0.0244211 0.0777344 -0.0156524 0.0142584 -0.0128497 0.1663007 0.0800784 0.0773439 0.0247578 0.0496799 0.0042728 -0.0308726 0.0139414 -0.0178818 0.152682 0.0170006 0.0669166 0.0213596 0.0820051 -0.0569203 -0.0378088 0.0258928 -0.0364219 0.155217 -0.0069717 -0.088843 -0.0012347 -0.0940893 -0.0403993 -0.0188373 0.0053498 -0.0152775 0.1600158 -0.1150386 0.0111223 0.0289772 0.0115877 0.0959339 -0.0103614 0.0357354 -0.0095989 0.1557119 0.0338109 -0.0019526 0.082549 0.0440779 0.3135914 0.0424765 0.0336771 0.0438494 0.2919796 unknown
polarizability: 125.1193129|0.3135479|98.1927118|-0.3646649|-1.9488005|44.498599 unknown
InChI: InChI=1S/C6H6O2S/c7-9(8)6-4-2-1-3-5-6/h1-5,7H
charge 0 multiplicity 1
15 atoms
S  2.070018 -0.06617 -0.467475
O  2.269202 -1.214152 1.043322
O  2.558877 1.454967 -0.1039
C  0.202197 -0.014727 -0.204433
C  -0.370314 1.244968 0.037076
C  -0.551791 -1.200737 -0.28193
C  -1.771443 1.319341 0.207058
C  -1.952636 -1.110124 -0.110524
C  -2.55891 0.146127 0.130247
H  0.27767 2.127088 0.10448
H  -0.067516 -2.168759 -0.444587
H  -2.244578 2.287735 0.400867
H  -2.564368 -2.017165 -0.15847
H  -3.644713 0.209595 0.261541
H  3.241204 -1.447388 1.089127
