program: Gaussian 09
title: 000129854
version: EM64L-G09RevD.01
frameworkgroup: C1[X(C15H11BrClNO2)]
method: RPBEPBE
basis: SDD
operation: Freq
keyword: #p
keyword: freq=noraman
keyword: PBEPBE/SDD
title: #p freq=noraman PBEPBE/SDD
converged: YES YES NO NO
title: Mulliken charges:
elementType: Br Cl O O N C C C C C C C C C C C C C C C H H H H H H H H H H H
charge: 0.017717 -0.049446 -0.275741 -0.251302 -0.448979 0.139069 0.308582 0.069572 0.292500 -0.270731 -0.340622 -0.273408 -0.187888 -0.364488 -0.359234 -0.233506 -0.229426 0.247919 -0.226160 -0.683299 0.294882 0.320023 0.403053 0.256631 0.271654 0.270922 0.237120 0.236649 0.237144 0.294919 0.295878
chargesum: 0.00000
title: Mulliken charges with hydrogens summed into heavy atoms:
elementType: Br Cl O O N C C C C C C C C C C C C C C C
charge: 0.017717 -0.049446 -0.275741 -0.251302 -0.045925 0.139069 0.308582 0.069572 0.292500 0.024151 -0.020600 -0.273408 0.068743 -0.092834 -0.088312 0.003614 0.007222 0.247919 0.010984 -0.092503
polarizability: 2.77678024e+02 -1.65622410e+01 2.66050699e+02 -1.12013312e+01 -1.77449305e+01 1.03824530e+02
1716.lowfreq: -3.0190 -1.4758 -0.0012 0.0007 0.0014 6.1070 12.8652 33.7475 49.0084
frequency: 12.6418 33.7304 49.0061 53.4405 65.4754 81.4481 85.3047 133.4316 136.6122 152.5470 171.4448 222.7830 228.1070 279.9229 294.7377 338.6173 372.5115 393.0884 405.8706 419.3462 431.2450 445.1357 505.6563 528.2847 575.7037 584.3176 613.8732 647.2570 661.6742 684.9493 703.9170 708.2379 741.8212 756.4292 803.8295 841.6448 854.9028 859.5263 902.1867 908.5801 920.3261 941.8321 947.8981 973.9779 987.9903 989.1522 992.7321 1005.5639 1026.7265 1084.4229 1088.4567 1112.2122 1163.9386 1165.3922 1176.4094 1191.8460 1219.5700 1241.1398 1266.4042 1275.7697 1296.4094 1321.1202 1371.5314 1382.5639 1383.3045 1416.6390 1428.2976 1438.7503 1477.8789 1495.2340 1540.4573 1566.6220 1583.7247 1593.5021 1602.6216 1607.0217 3065.0115 3132.1212 3141.1481 3143.5315 3151.7910 3156.2662 3161.7399 3167.0951 3172.0993 3177.3730 3191.6221
redmass: 8.2874 8.2247 5.2013 4.0207 4.5205 6.5629 8.6911 6.8916 12.6321 6.8798 7.3538 5.4214 9.8670 7.1198 7.4653 5.8422 11.6286 6.8275 2.8580 7.7379 4.9409 4.4164 5.0233 3.6783 3.2121 5.9735 6.4502 6.9367 6.5658 5.3959 1.8722 4.7637 4.1981 3.6562 2.9164 5.6833 1.4226 1.2575 1.7543 1.8934 2.8834 3.9674 1.5742 1.1558 1.4096 5.5433 1.3286 1.3371 2.2545 1.9673 1.8210 2.6223 1.1088 1.8076 1.0558 1.1198 3.1071 1.7317 1.2070 2.5629 1.9883 1.3534 9.6046 6.0282 5.0926 1.1660 2.4424 2.5508 2.2483 3.6684 4.8744 4.5529 5.9849 5.7574 4.1327 5.9881 1.0567 1.0853 1.0883 1.1084 1.0927 1.0826 1.0962 1.0909 1.1011 1.0921 1.0956
irintensity: 1.2822 0.1539 0.5266 2.0198 1.3754 6.3500 5.6766 1.3779 2.4815 2.0458 2.9864 0.9057 1.0360 9.7396 11.2390 2.1481 6.9089 4.9739 0.6560 6.0438 12.9880 3.0726 4.2098 21.2628 2.8553 3.2314 0.2001 40.2276 22.7148 1.7031 40.5628 104.7703 10.5093 35.0478 16.0468 10.6256 44.0076 5.2185 0.4354 23.4014 13.1955 32.3371 14.7013 88.8328 5.4634 1.8654 6.6356 0.6918 4.7873 21.8638 7.7723 5.6088 0.4517 15.2243 0.3144 25.1078 13.0286 17.3742 16.1957 368.7269 178.7805 19.4528 102.5925 3.8324 23.9453 52.3936 24.9400 36.3248 6.6021 732.7620 41.7603 522.5023 2.2277 76.0480 20.9964 16.3124 4.5028 0.2494 3.8776 0.9594 8.5692 250.2302 22.1705 0.9977 15.3981 0.2530 12.2228
temp: 298.150 k
press: 1.00000 atm
elementType: 35 17 8 8 7 6 6 6 6 6 6 6 6 6 6 6 6 6 6 6 1 1 1 1 1 1 1 1 1 1 1
symmnumber: 1
zpe: 583936.0 jmol-1
zpe.correction: 0.222409 hartree
zpe.thermalcorrener: 0.240459 hartree
zpe.thermalcorrenthalpy: 0.241403 hartree
zpe.thermalcorrgfe: 0.172256 hartree
zpe.sumelectzpe: -1255.540720 hartree
zpe.sumelectthermal: -1255.522671 hartree
zpe.sumelectthermalent: -1255.521727 hartree
zpe.sumelectthermalfe: -1255.590874 hartree
dipole: -2.1154 2.0895 0.5198
dipole: 3.0185
quadrupole: -132.8981 -123.4276 -131.4018
quadrupole: -10.8072 -3.1045 1.2643
quadrupole: -3.6556 5.8149 -2.1593 -10.8072 -3.1045 1.2643
hfenergy: -1255.7631295 hartree
pointgroup: C01 [X(C15H11Br1Cl1N1O2)]
dipole: -1.1544666 -0.060453 0.2717567 debye
polarizability: 287.9311484|6.0099269|257.000803|-5.372713|-15.5250081|102.6213015 unknown
InChI: InChI=1S/C15H11BrClNO2/c16-11-6-7-13(18-14(19)9-17)12(8-11)15(20)10-4-2-1-3-5-10/h1-8,18H,9H2
charge 0 multiplicity 1
31 atoms
Br -0.910085 -4.669189 -0.458858
Cl 2.889039 3.658701 -0.442122
O  -0.102032 1.846459 -0.667574
O  4.424248 -0.039531 0.283108
N  2.223426 0.683756 -0.194037
C  0.076748 -0.526184 -0.277115
C  1.518242 -0.543486 -0.18633
C  -0.68952 0.755694 -0.332388
C  -2.148085 0.811589 0.011362
C  -0.619172 -1.765472 -0.367164
C  2.193387 -1.792764 -0.099535
C  0.077407 -2.98048 -0.314283
C  1.479846 -3.00378 -0.161518
C  -2.729964 0.017465 1.037862
C  -2.947098 1.780888 -0.654402
C  -4.090981 0.180007 1.374983
C  -4.309944 1.926156 -0.329902
C  3.575106 0.869473 0.023433
C  -4.886243 1.124426 0.685299
C  4.129107 2.294959 -0.053794
H  -1.702356 -1.760736 -0.507176
H  3.279198 -1.798288 0.007865
H  1.626035 1.509809 -0.422765
H  2.018147 -3.954386 -0.107395
H  -2.114417 -0.69459 1.597178
H  -2.478197 2.410955 -1.417037
H  -4.527779 -0.424266 2.177155
H  -4.921752 2.664428 -0.859061
H  -5.944476 1.24236 0.943332
H  4.893384 2.336828 -0.844024
H  4.582983 2.552898 0.914506
