program: Gaussian 09
title: 000129865
version: EM64L-G09RevD.01
frameworkgroup: C1[X(C20H23NO3)]
method: RPBEPBE
basis: SDD
operation: Freq
keyword: #p
keyword: freq=noraman
keyword: PBEPBE/SDD
title: #p freq=noraman PBEPBE/SDD
converged: YES YES NO NO
title: Mulliken charges:
elementType: O O O N C C C C C C C C C C C C C C C C C C C C H H H H H H H H H H H H H H H H H H H H H H H
charge: -0.222694 -0.423183 -0.229309 -0.157544 -0.131459 -0.150745 -0.463193 -0.480140 -0.437250 -0.431889 0.046982 0.141965 0.348553 -0.567038 -0.401258 0.390093 0.428097 -0.450093 -0.473385 -0.584182 0.416481 -0.368942 -0.644328 -0.646314 0.204634 0.247494 0.242610 0.210140 0.221118 0.261915 0.196309 0.238755 0.227600 0.196351 0.241720 0.277823 0.375944 0.234984 0.235753 0.250626 0.240464 0.219809 0.235773 0.235996 0.218793 0.237751 0.238413
chargesum: 0.00000
title: Mulliken charges with hydrogens summed into heavy atoms:
elementType: O O O N C C C C C C C C C C C C C C C C C C C C
charge: -0.222694 -0.047239 -0.229309 -0.157544 0.073176 0.096749 -0.010443 0.002893 -0.002187 -0.007939 0.046982 0.141965 0.348553 -0.325318 -0.123435 0.390093 0.428097 -0.215109 -0.237632 -0.333556 0.416481 -0.128478 0.047250 0.048642
chargesum: -0.00002
polarizability: 4.30666922e+02 4.63923668e+01 2.23585826e+02 -1.44329824e+01 1.07614683e+01 1.45339647e+02
1716.lowfreq: -16.2562 -4.3955 -1.4632 -0.0008 -0.0002 6.8996 17.1791 26.2274 31.3782
frequency: 16.0038 25.5090 31.3761 47.6730 50.0215 64.0345 72.4138 110.0757 131.4816 138.9786 154.1217 175.4783 187.4428 207.0196 225.3044 242.3543 244.2196 278.0666 295.4749 314.9695 346.7123 360.2442 372.6687 395.6156 410.6569 415.4050 453.1280 470.2148 483.6995 511.6403 521.1088 522.2997 541.9209 550.8827 557.3680 633.5878 642.1557 653.6265 686.7927 693.7909 721.2739 761.6599 778.8027 784.1120 794.2463 809.6592 818.7466 823.5039 834.0558 884.4950 886.9664 898.1738 904.5598 917.3768 932.2601 939.8996 963.7896 965.2427 974.6412 1001.8415 1021.5186 1038.1451 1056.7269 1060.3666 1069.3232 1099.0930 1099.9956 1107.2359 1111.9372 1130.8775 1155.9532 1158.0150 1170.0859 1174.4050 1190.5020 1220.0426 1234.0531 1245.8065 1259.5761 1262.3420 1270.3838 1279.1451 1284.6124 1292.3779 1314.1155 1315.4923 1337.4753 1341.3698 1350.3542 1359.6261 1360.7006 1364.1324 1405.1599 1422.1667 1436.8726 1446.9318 1452.6923 1456.8332 1464.5624 1465.6284 1468.6388 1477.0988 1483.1265 1484.6545 1493.7351 1508.9446 1518.6670 1553.3107 1574.2379 1613.7666 1640.8546 1653.6567 2942.6578 2950.3125 2968.2883 2970.0028 2979.7558 2990.9386 2996.8784 2999.3282 3009.1581 3013.5485 3049.5027 3054.9648 3061.3726 3068.2236 3099.0610 3108.7877 3121.6897 3122.4775 3128.4546 3154.0619 3160.4225 3168.6976 3511.5331
redmass: 5.6389 4.3460 7.5126 5.3507 5.1421 2.7359 6.2942 2.7677 2.1054 4.1032 2.6972 1.7856 3.0886 3.6766 1.7055 3.4306 2.9314 2.4185 4.2125 4.3839 3.9279 2.5629 3.4409 3.4297 3.2132 3.2615 3.6252 2.4403 3.2988 4.1799 2.9321 5.0548 3.6916 3.6304 2.4024 2.0311 3.6064 3.2771 3.4395 4.8933 4.2073 4.3779 2.0260 1.7910 2.7121 1.6443 2.9531 1.9076 2.4014 2.8538 2.5729 2.6534 1.9782 1.9929 2.5269 1.8249 1.4267 2.6887 2.6146 1.3467 2.6159 2.2414 1.5140 2.0595 1.8351 1.4525 1.5804 1.2447 1.3158 1.5354 1.9038 1.8672 1.2782 1.3322 1.3723 1.5605 1.6917 1.4155 1.6645 3.2268 1.2728 1.4796 1.6022 1.7351 1.4517 1.6032 1.3983 1.9278 1.6493 1.5352 1.8639 2.7577 2.9276 2.3675 1.4912 8.3461 1.0863 1.3769 1.0415 1.0817 1.0899 1.0459 1.0888 1.8880 1.2317 1.5442 1.9334 8.0124 7.6691 5.8922 6.6157 8.5988 1.0369 1.0393 1.0807 1.0745 1.0653 1.0722 1.0603 1.0625 1.0999 1.1025 1.0976 1.1004 1.1018 1.0983 1.0961 1.0942 1.0894 1.0891 1.0900 1.0900 1.0950 1.0936 1.0640
irintensity: 0.9042 0.1951 1.2164 0.2840 0.2874 0.2479 0.4254 7.4777 0.2360 0.5799 0.2649 0.2474 1.4920 4.2731 2.6525 0.8833 1.9335 0.4905 2.5726 4.1651 2.6074 1.5037 10.4260 3.2131 0.3573 1.8788 20.5280 17.1242 6.1275 4.2959 7.5107 0.0391 13.9583 2.5851 31.2749 50.1084 33.7595 0.5540 53.7582 4.2001 10.3328 5.6283 0.9399 2.9164 2.2889 31.3505 7.2743 0.2818 4.3456 35.5076 42.0956 6.3897 28.6081 27.1798 33.6856 26.6448 3.6314 3.0255 127.7065 0.1460 48.1870 195.5073 25.5053 26.6197 7.5145 1.1220 6.9818 0.1168 0.8441 25.9277 49.4511 1.0473 29.4480 61.0166 98.2229 47.4778 171.9753 1.9266 1.2755 24.3836 6.1900 30.5390 96.3654 43.9224 27.7020 58.1752 1.7296 1.0751 23.4633 7.0137 61.7280 31.6378 4.8210 27.2389 23.5554 86.9879 13.2259 47.9954 0.7094 9.1526 8.9458 22.5473 15.0738 44.6802 9.4157 28.3976 308.7622 206.6140 136.4226 6.1912 443.4645 192.7563 92.4250 146.7832 7.9753 31.6807 11.4275 73.9012 31.2904 2.5789 17.1245 66.8031 36.6833 11.3509 32.3928 45.3445 3.7191 49.8848 2.8500 18.3255 16.9322 14.2700 10.6108 19.1855 25.2567
temp: 298.150 k
press: 1.00000 atm
elementType: 8 8 8 7 6 6 6 6 6 6 6 6 6 6 6 6 6 6 6 6 6 6 6 6 1 1 1 1 1 1 1 1 1 1 1 1 1 1 1 1 1 1 1 1 1 1 1
symmnumber: 1
zpe: 1016935.2 jmol-1
zpe.correction: 0.387330 hartree
zpe.thermalcorrener: 0.409788 hartree
zpe.thermalcorrenthalpy: 0.410733 hartree
zpe.thermalcorrgfe: 0.333444 hartree
zpe.sumelectzpe: -1054.616699 hartree
zpe.sumelectthermal: -1054.594241 hartree
zpe.sumelectthermalent: -1054.593296 hartree
zpe.sumelectthermalfe: -1054.670585 hartree
dipole: -6.2478 -4.0746 -1.4010
dipole: 7.5895
quadrupole: -90.8939 -138.9663 -150.8923
quadrupole: -1.8955 -8.7761 4.3788
quadrupole: 36.0236 -12.0488 -23.9748 -1.8955 -8.7761 4.3788
hfenergy: -1055.0040289 hartree
pointgroup: C01 [X(C20H23N1O3)]
dipole: -2.4610401 1.6817872 -0.1754516 debye
polarizability: 430.4952587|-35.639859|218.0936498|33.8307289|-22.5663448|151.0034862 unknown
InChI: InChI=1S/C20H23NO3/c1-21(2)18-10-9-15-11-17(8-7-16(15)12-18)19(22)13-3-5-14(6-4-13)20(23)24/h7-14,23H,3-6H2,1-2H3
charge 0 multiplicity 1
47 atoms
O  1.991446 -2.201872 1.109315
O  7.043041 0.141338 -0.138177
O  5.75538 -0.413285 -1.980273
N  -6.286583 0.484719 -0.495741
C  2.401801 0.130273 0.541442
C  4.974428 1.373296 -0.426642
C  3.713446 0.010546 1.353918
C  2.72314 0.260643 -0.981793
C  4.655671 1.204641 1.088917
C  3.673877 1.44856 -1.262267
C  1.486171 -1.083532 0.773741
C  5.902412 0.28036 -0.949388
C  0.009402 -0.955983 0.569417
C  -0.6239 0.248852 0.211543
C  -0.8027 -2.13337 0.74981
C  -2.036629 0.320308 0.029572
C  -2.848144 -0.867199 0.215542
C  -2.180585 -2.090712 0.580227
C  -2.703046 1.53749 -0.332964
C  -4.258589 -0.799149 0.038019
C  -4.902924 0.412855 -0.320194
C  -4.081607 1.591988 -0.503226
C  -6.932285 1.753889 -0.859527
C  -7.104793 -0.721341 -0.315826
H  1.876475 1.054786 0.85981
H  5.546205 2.317404 -0.547616
H  4.207351 -0.944659 1.094867
H  3.480708 -0.047908 2.43401
H  1.79007 0.387975 -1.562123
H  3.194525 -0.677156 -1.330863
H  4.173661 2.141597 1.434978
H  5.595199 1.088104 1.656283
H  3.917922 1.474271 -2.339962
H  3.161705 2.400373 -1.014612
H  -0.039417 1.164994 0.066396
H  -0.287814 -3.059104 1.026153
H  7.629051 -0.563751 -0.526585
H  -2.781303 -2.997068 0.723611
H  -2.105336 2.445809 -0.47857
H  -4.838249 -1.714915 0.186637
H  -4.546889 2.541802 -0.779953
H  -8.018877 1.596783 -0.944285
H  -6.570054 2.139663 -1.833873
H  -6.763332 2.538222 -0.094464
H  -8.163658 -0.479441 -0.496596
H  -7.016934 -1.126175 0.713057
H  -6.810744 -1.523319 -1.023145
