program: Gaussian 09
title: 000129820
version: EM64L-G09RevD.01
frameworkgroup: C1[X(C7H3Cl5OS)]
method: RPBEPBE
basis: SDD
operation: Freq
keyword: #p
keyword: freq=noraman
keyword: PBEPBE/SDD
title: #p freq=noraman PBEPBE/SDD
converged: YES YES NO NO
title: Mulliken charges:
elementType: Cl Cl Cl Cl Cl S O C C C C C C C H H H
charge: 0.029195 0.065208 0.065475 0.064984 0.072231 0.706378 -0.564673 0.003023 -0.124874 -0.150318 -0.064262 -0.064446 -0.075802 -0.793555 0.261677 0.293667 0.276093
chargesum: 0.00000
title: Mulliken charges with hydrogens summed into heavy atoms:
elementType: Cl Cl Cl Cl Cl S O C C C C C C C
charge: 0.029195 0.065208 0.065475 0.064984 0.072231 0.706378 -0.564673 0.003023 -0.124874 -0.150318 -0.064262 -0.064446 -0.075802 0.037881
polarizability: 2.12345578e+02 4.67201132e+00 1.82149972e+02 7.00654433e-02 4.16946298e+00 7.67110174e+01
1716.lowfreq: -0.2770 -0.0030 -0.0026 -0.0020 3.6882 5.8157 43.7851 45.7401 64.5616
frequency: 43.7674 45.7351 64.5604 79.6383 130.9254 141.5294 166.7263 166.8247 198.3584 204.3412 207.7010 212.3966 219.7471 283.9149 304.5285 318.0294 326.8250 332.1016 340.1162 357.4304 537.8734 567.5896 580.5270 596.7758 602.0169 626.1328 771.7881 785.2832 802.9389 831.2305 948.5761 967.9618 1005.5559 1151.7217 1292.3394 1301.1150 1305.3085 1343.8627 1413.2339 1433.5189 1514.3124 1528.7743 3021.5935 3162.8598 3173.3585
redmass: 8.7670 6.3243 16.1745 25.4558 5.8010 3.9629 3.0731 1.7641 10.7939 30.4674 19.7576 19.9617 32.2630 5.4611 27.4523 15.4237 13.1055 20.0175 9.8321 23.6524 7.2083 14.9526 12.2422 11.0717 12.0972 15.3153 11.5110 12.6722 12.9618 10.0930 1.2417 1.3494 11.5766 12.1985 9.7426 1.1920 9.5452 11.9782 1.0540 1.0564 11.9622 11.9632 1.0253 1.1062 1.1071
irintensity: 2.0457 3.4835 0.7538 0.2895 1.1290 2.7895 0.2078 0.7650 2.0465 0.0893 0.4291 0.4259 0.0655 8.7358 0.8923 5.2124 0.0857 16.6668 5.4496 4.6822 11.5231 2.9919 1.4846 1.9565 0.1062 74.3309 0.0538 46.7561 2.2067 42.3983 17.9551 11.4985 17.3399 57.2324 134.8091 13.6106 143.6880 18.4769 10.7081 15.4214 20.7225 4.4689 4.4905 2.5657 1.3656
temp: 298.150 k
press: 1.00000 atm
elementType: 17 17 17 17 17 16 8 6 6 6 6 6 6 6 1 1 1
symmnumber: 1
zpe: 211807.5 jmol-1
zpe.correction: 0.080673 hartree
zpe.thermalcorrener: 0.096367 hartree
zpe.thermalcorrenthalpy: 0.097311 hartree
zpe.thermalcorrgfe: 0.035757 hartree
zpe.sumelectzpe: -3040.983889 hartree
zpe.sumelectthermal: -3040.968195 hartree
zpe.sumelectthermalent: -3040.967251 hartree
zpe.sumelectthermalfe: -3041.028805 hartree
dipole: 0.2224 1.7443 3.1038
dipole: 3.5673
quadrupole: -125.5052 -123.5314 -122.6827
quadrupole: -7.2092 -12.0672 -1.0580
quadrupole: -1.5988 0.3751 1.2237 -7.2092 -12.0672 -1.0580
hfenergy: -3041.064562 hartree
pointgroup: C01 [X(C7H3Cl5O1S1)]
dipole: 0.1388004 0.5084669 1.3007546 debye
dipolederiv: -0.0786218 0.1949557 0.0345871 0.0103947 -0.6527214 -0.0937837 -0.0124121 -0.105476 -0.0214808 -0.1740402 -0.3106406 0.01074 -0.2058042 -0.4142536 -0.0275919 0.015046 0.0071931 0.0195094 -0.1231508 0.2176267 0.0232135 0.3184386 -0.6296723 -0.0731212 0.0365209 -0.0647526 0.0107195 -0.4043929 -0.3469883 -0.0478192 -0.4095535 -0.3723861 -0.0523374 -0.0685685 -0.068961 0.0090099 -0.6742064 0.1306198 0.0326627 0.145166 -0.0237504 -0.008084 0.0347804 -0.0100603 0.021529 1.1493837 -0.1261435 0.2308221 -0.0363485 0.3094258 0.0706954 0.263833 -0.1096253 0.8185084 -0.5937609 0.093561 -0.1441841 -0.1310891 -0.2701258 -0.1942629 -0.166095 0.1350605 -0.5309464 -0.5763311 -0.0833255 -0.0695763 0.0928753 -0.4788409 0.0101277 -0.1699824 -0.0524481 -0.106133 0.0371814 -0.3561236 -0.0547003 0.0476238 0.87601 0.1515875 -0.0089831 0.1643007 -0.0207353 0.2317897 0.5732467 -0.0219181 0.2185175 0.5039047 -0.0242628 -0.0045519 -0.0023085 -0.0438509 -0.148675 -0.4528976 -0.0220991 -0.4177504 0.8487156 0.1206751 0.0037223 0.1038086 -0.0047952 0.3534486 0.6746048 0.1068174 0.6400675 0.3533223 0.0485453 0.1248367 0.0574084 -0.0040974 0.9643585 -0.2335742 -0.048898 -0.2491549 -0.151732 -0.0175508 -0.078412 -0.0083229 -0.0222508 -0.0857518 0.0137252 -0.0273954 0.0065307 -0.0533876 0.0778349 0.0321295 0.0006789 -0.2084956 0.0525409 -0.0690353 -0.0431482 -0.059217 0.0556767 -0.036123 -0.0257417 -0.04095 -0.0185605 0.1213628 0.0349225 0.0075375 0.0031047 -0.0152004 0.0382028 -0.0153934 -0.0044712 0.0372968 -0.0511347 0.0454661 0.0333585 0.0261988 0.1150153 0.0094489 0.0392713 -0.0010744 0.0647728 unknown
polarizability: 212.7980543|2.9115749|178.6670384|-0.3665344|18.047474|79.7414754 unknown
InChI: InChI=1S/C7H3Cl5OS/c1-14(13)7-5(11)3(9)2(8)4(10)6(7)12/h1H3
charge 0 multiplicity 1
17 atoms
Cl -0.397637 2.925575 0.383606
Cl -1.551935 -2.49479 -0.224642
Cl 1.579813 -3.141899 -0.395216
Cl 2.750036 2.257635 0.297253
Cl 3.730245 -0.772663 -0.146752
S  -2.666059 0.757984 -0.2330
O  -3.458059 -0.320452 -1.202267
C  -0.788467 0.190459 -0.029682
C  0.161169 1.215645 0.123433
C  -0.358777 -1.142747 -0.158936
C  1.025287 -1.442198 -0.203872
C  1.546171 0.937522 0.098491
C  1.975441 -0.399966 -0.081793
C  -3.191536 0.287847 1.567553
H  -2.588562 0.881653 2.270077
H  -3.027389 -0.792493 1.679722
H  -4.260341 0.539687 1.628726
