program: Gaussian 09
title: 000129826
version: EM64L-G09RevD.01
frameworkgroup: C1[X(C15H17N3O2)]
method: RPBEPBE
basis: SDD
operation: Freq
keyword: #p
keyword: freq=noraman
keyword: PBEPBE/SDD
title: #p freq=noraman PBEPBE/SDD
converged: NO YES NO NO
title: Mulliken charges:
elementType: O O N N N C C C C C C C C C C C C C C C H H H H H H H H H H H H H H H H H
charge: -0.247892 -0.241436 -0.202970 -0.040491 -0.399688 -0.197476 0.399288 -0.564697 0.236467 0.047670 0.391522 -0.491844 -0.532248 -0.624956 0.146171 -0.357257 -0.408531 -0.696180 0.185877 -0.658409 0.237444 0.235604 0.233138 0.253376 0.242657 0.254217 0.254377 0.229522 0.249623 0.280000 0.234534 0.237513 0.223789 0.232705 0.237954 0.283890 0.336736
chargesum: 0.00000
title: Mulliken charges with hydrogens summed into heavy atoms:
elementType: O O N N N C C C C C C C C C C C C C C C
charge: -0.247892 -0.241436 -0.202970 -0.040491 -0.062951 0.039967 0.399288 -0.095955 0.236467 0.047670 0.391522 0.004190 -0.023654 -0.395433 0.146171 -0.107634 -0.128530 -0.000344 0.185877 0.096140
polarizability: 3.70607096e+02 -1.09644501e+01 1.76219955e+02 -1.12142045e+00 -6.53384907e+00 1.06856884e+02
1716.lowfreq: -8.9926 -5.6850 -0.0007 -0.0005 0.0002 6.3672 25.8005 34.7808 73.0403
frequency: 25.6348 34.5903 73.0365 91.7242 99.8754 108.2456 136.9706 177.6948 204.3848 216.3881 219.3905 231.2629 250.2799 270.7366 328.0933 329.4940 375.4474 388.2063 394.9923 414.5563 448.6485 465.5189 473.3608 506.0435 518.3853 549.3316 576.9558 589.2569 601.3376 623.0362 658.7389 687.2144 700.7196 714.7109 743.9399 752.7589 828.9556 843.8535 857.8895 863.5197 877.4836 894.3838 897.5800 946.1118 985.3080 997.7458 1014.4617 1025.2902 1033.4036 1065.6376 1074.7599 1079.6163 1121.9968 1131.0271 1139.9711 1148.4071 1162.6396 1188.1476 1203.3234 1209.4014 1250.4899 1272.5567 1281.5873 1294.7808 1304.6617 1312.0765 1323.0765 1333.3155 1341.2059 1373.9044 1379.3070 1390.0490 1406.2695 1425.4967 1435.3164 1440.4106 1451.2983 1461.4224 1473.1620 1477.9622 1479.4930 1500.2021 1508.4516 1542.0435 1580.5247 1603.7151 1625.2137 1632.7175 2968.3860 2983.6515 2986.7466 2988.0644 2991.8895 3027.7744 3050.6477 3074.0238 3081.5650 3083.9192 3088.8120 3091.6245 3123.4173 3132.3039 3156.9684 3176.9023 3546.4896
redmass: 3.6023 7.0742 6.8345 5.6885 3.4525 3.7252 3.8047 3.2237 3.7951 2.3826 1.1021 1.2910 2.6505 4.8829 2.7541 3.6415 3.5040 5.9895 4.7234 3.8185 5.2885 3.5134 4.9132 3.0723 4.1748 3.6647 5.0945 3.6050 3.5754 5.6717 3.5397 3.3915 3.5634 1.5744 4.9242 3.6762 3.3100 1.4596 2.3941 2.4258 2.4687 1.8481 2.4141 1.8776 1.3543 2.3133 2.5000 1.8704 2.2555 3.1101 2.7711 2.1418 1.3368 2.0992 2.1345 1.5729 1.2289 1.4898 1.7769 1.3834 2.0818 1.7805 1.8643 1.9170 2.4037 1.5074 2.0564 2.7142 1.6356 1.7820 6.1477 1.2722 1.6197 1.2656 3.0620 1.1325 1.0994 1.1121 1.0477 1.0845 1.0637 1.0608 2.9783 5.9234 7.6397 8.7453 6.9820 6.3733 1.0672 1.0350 1.0363 1.0661 1.0656 1.0848 1.0952 1.1002 1.1002 1.0956 1.0998 1.0953 1.0993 1.0900 1.0875 1.0961 1.0783
irintensity: 0.6880 2.0606 1.0300 1.8966 2.4365 2.2795 5.6247 1.7686 1.8570 2.2723 0.2544 0.3843 1.0491 2.5707 1.1582 3.7427 7.2803 7.9858 7.1217 3.9776 10.6039 7.8193 31.7778 4.8768 12.2412 1.6100 1.1237 4.2750 6.0979 10.0714 8.1946 16.0848 17.9288 105.3953 3.7122 5.3494 0.2933 38.7759 19.1178 12.8954 8.9666 14.4049 7.8311 28.8095 0.9117 9.8647 18.2016 33.2699 14.4631 10.2737 25.1873 6.2777 15.0992 179.2955 4.9121 15.3508 1.1669 110.7549 17.1309 24.6971 24.4288 47.1394 130.0923 112.7576 16.0324 6.0406 34.7502 325.2436 18.3540 7.1162 19.0220 28.5174 12.9539 48.0024 13.3560 9.7673 12.0834 14.1695 9.9234 76.1668 7.9908 39.2072 125.4223 4.4364 18.2759 597.2418 4.7878 420.2900 24.1453 22.6948 40.7816 13.3599 17.6426 16.1811 20.0494 25.0418 19.7370 12.3579 27.1752 15.0013 1.1229 14.4595 5.3531 7.7735 43.0636
temp: 298.150 k
press: 1.00000 atm
elementType: 8 8 7 7 7 6 6 6 6 6 6 6 6 6 6 6 6 6 6 6 1 1 1 1 1 1 1 1 1 1 1 1 1 1 1 1 1
symmnumber: 1
zpe: 783708.2 jmol-1
zpe.correction: 0.298499 hartree
zpe.thermalcorrener: 0.316236 hartree
zpe.thermalcorrenthalpy: 0.317180 hartree
zpe.thermalcorrgfe: 0.252430 hartree
zpe.sumelectzpe: -895.064658 hartree
zpe.sumelectthermal: -895.046921 hartree
zpe.sumelectthermalent: -895.045977 hartree
zpe.sumelectthermalfe: -895.110727 hartree
dipole: -0.9717 1.1003 -0.3409
dipole: 1.5070
quadrupole: -174.1603 -102.0218 -116.6759
quadrupole: 7.4028 1.6025 -1.9974
quadrupole: -43.2076 28.9308 14.2768 7.4028 1.6025 -1.9974
hfenergy: -895.3631569 hartree
pointgroup: C01 [X(C15H17N3O2)]
dipole: -0.3815044 -0.443661 0.095656 debye
polarizability: 370.6317063|10.7361691|176.8213056|-0.5517971|0.1367089|106.230923 unknown
InChI: InChI=1S/C15H17N3O2/c1-9-7-13(19)16-17-15(9)11-3-5-12-10(8-11)4-6-14(20)18(12)2/h3,5,8-9,16H,4,6-7H2,1-2H3
charge 0 multiplicity 1
37 atoms
O  -5.801886 -0.289645 -0.160496
O  6.210812 0.299188 0.050098
N  -3.689588 0.684252 0.078426
N  2.742548 1.380124 -0.242153
N  4.142348 1.292699 -0.299945
C  2.779725 -1.109537 -0.044159
C  -1.647786 -0.705426 0.094052
C  -2.540396 -1.922819 0.248249
C  -2.266611 0.577426 0.025472
C  2.066723 0.24499 -0.085344
C  0.589674 0.349305 -0.036482
C  -3.848398 -1.722615 -0.54329
C  4.157876 -0.957379 0.648144
C  -0.244681 -0.800081 0.053284
C  -4.542549 -0.410273 -0.186516
C  -1.446474 1.735882 -0.058971
C  -0.048633 1.62098 -0.08898
C  2.922363 -1.667139 -1.489914
C  4.950494 0.223954 0.103319
C  -4.315938 1.998822 0.32839
H  2.185105 -1.827621 0.547431
H  -2.021133 -2.836992 -0.089933
H  -2.785766 -2.071846 1.320455
H  -4.573375 -2.532004 -0.360445
H  -3.634714 -1.708079 -1.631068
H  4.768953 -1.867479 0.529804
H  4.025163 -0.788833 1.736069
H  0.19596 -1.802376 0.101498
H  -1.897244 2.730832 -0.107585
H  0.577428 2.514635 -0.158799
H  1.935933 -1.77307 -1.974162
H  3.536686 -0.995341 -2.116234
H  3.410425 -2.65875 -1.471687
H  -4.166747 2.683617 -0.526867
H  -3.894861 2.457147 1.239581
H  -5.395292 1.8298 0.457689
H  4.600556 2.167053 -0.565633
