program: Gaussian 09
title: 000129837
version: EM64L-G09RevD.01
frameworkgroup: C1[X(C14H20N2O3S)]
method: RPBEPBE
basis: SDD
operation: Freq
keyword: #p
keyword: freq=noraman
keyword: PBEPBE/SDD
title: #p freq=noraman PBEPBE/SDD
converged: YES YES NO NO
title: Mulliken charges:
elementType: S O O O N N C C C C C C C C C C C C C C H H H H H H H H H H H H H H H H H H H H
charge: 0.214407 -0.269036 -0.424411 -0.241995 -0.262644 -0.616724 -0.057900 0.366018 -0.683766 -0.688204 0.241432 -0.826025 -0.718290 -0.321617 -0.334396 -0.105964 -0.222700 -0.226931 -0.235572 0.247325 0.262336 0.217470 0.222482 0.226197 0.223687 0.219031 0.223913 0.344292 0.282422 0.280601 0.254334 0.254368 0.251709 0.252618 0.231641 0.230581 0.231488 0.280493 0.298422 0.378911
chargesum: 0.00000
title: Mulliken charges with hydrogens summed into heavy atoms:
elementType: S O O O N N C C C C C C C C C C C C C C
charge: 0.214407 -0.269036 -0.045500 -0.241995 -0.262644 -0.037809 0.204436 0.366018 -0.017617 -0.021574 0.241432 -0.199312 -0.183355 -0.067249 -0.082687 0.146654 0.008941 0.003649 -0.004084 0.247325
polarizability: 2.10401075e+02 3.75929695e+00 1.96453804e+02 -6.69583939e+00 -6.50831021e-01 1.61345802e+02
1716.lowfreq: -15.7583 -10.7162 -5.6719 0.0014 0.0015 0.0017 6.4045 10.9203 27.9889
frequency: -7.1365 8.4174 27.7886 35.5064 40.6622 48.1515 62.1234 74.7257 111.4601 117.3383 136.4806 155.1514 184.6655 210.5401 230.1140 231.2610 252.0511 257.8585 261.8330 279.2952 296.5666 300.7419 370.1220 383.0582 412.5491 418.6751 463.3068 465.4997 476.2897 543.4265 570.1124 571.7107 574.8157 619.3663 631.1411 643.2812 686.0689 696.1875 705.4559 732.2467 745.8950 769.0248 776.6769 853.4704 865.2238 905.9063 919.8818 920.0663 926.7952 940.9990 941.3469 980.7288 982.9138 989.1392 990.7439 998.0501 1024.5463 1047.9682 1074.8617 1087.3056 1120.0477 1141.8453 1150.0739 1160.4641 1171.8657 1179.1587 1179.8446 1211.9879 1227.3058 1245.7036 1250.8414 1259.7084 1304.6246 1306.0290 1315.4029 1339.8535 1371.3794 1373.6861 1382.4556 1391.7302 1391.9402 1428.5744 1433.9472 1438.2532 1464.5046 1469.1080 1475.3651 1483.3776 1487.1000 1583.1947 1587.3752 1608.6709 1624.8643 1672.5686 2906.6143 2980.3433 2983.2111 3012.9361 3028.6088 3030.6328 3075.7999 3083.9652 3085.0589 3087.2864 3089.7516 3108.5302 3128.4349 3137.1318 3149.5618 3157.6361 3169.6585 3461.7944 3516.3119 3594.8029
redmass: 5.3155 6.0092 2.8972 4.2667 4.0211 8.5042 7.4849 6.9289 3.6216 4.9531 2.7879 5.3592 4.2645 3.6927 1.0752 1.2700 4.0435 3.8449 1.0948 2.6143 2.7902 3.2861 5.5006 6.4292 2.8782 3.2981 2.9105 3.9629 3.9545 3.4297 3.1293 3.4923 1.3072 6.1521 1.4686 5.3738 4.0037 5.0006 1.8458 4.0793 3.7546 2.3283 2.7891 1.2370 2.7894 1.7474 1.8777 1.3300 1.4314 1.4037 3.3387 1.3859 2.7713 2.9796 5.3738 1.3522 2.0187 2.3404 1.5493 2.5680 1.9726 2.4696 1.1431 1.1175 1.0551 1.3260 1.5518 1.4720 1.8688 1.6882 1.5029 1.6582 1.4570 1.3667 2.2551 1.3329 7.9077 1.2219 1.6722 1.8947 1.2240 1.1013 2.1905 1.1099 1.0456 1.0523 1.2253 1.7843 1.0643 8.3162 6.3179 6.3855 1.0970 8.7415 1.0813 1.0348 1.0357 1.0576 1.0601 1.0855 1.0997 1.0994 1.0998 1.1045 1.0999 1.1044 1.0849 1.0883 1.0928 1.0968 1.1016 1.0445 1.0640 1.0986
irintensity: 0.2663 0.6448 0.0354 2.3327 1.3447 2.8201 0.3372 0.8705 0.5332 1.1289 6.3506 4.5096 2.8117 10.6042 6.5026 30.4620 4.7965 2.1816 1.2303 8.7695 8.1330 0.0909 6.5727 15.6158 0.0395 5.0290 8.1684 39.0267 2.7957 18.8681 18.0108 7.6398 27.7400 0.3927 279.5138 26.6496 39.9558 5.6548 66.1674 8.9897 3.3792 8.4880 23.8316 0.0423 1.2103 12.9418 7.4235 3.4734 0.6343 0.3686 0.5365 0.2373 5.6348 21.0974 0.5403 0.2503 9.3201 332.6547 11.6205 23.3921 92.1116 11.4425 8.0605 9.5572 0.1487 3.1649 9.9789 11.6466 132.6504 15.0145 23.4914 15.6082 54.8212 7.5486 137.1585 1.0691 0.6404 25.9909 44.4261 12.4718 6.3968 28.9898 6.8386 9.0865 4.2795 0.5922 48.0068 19.8973 25.4436 238.3623 7.6948 6.2464 44.2797 260.0408 39.8714 22.7095 23.7752 37.7578 25.1816 9.5914 0.1500 52.6816 50.2392 4.3630 30.0909 9.0982 0.7850 3.6091 23.8522 22.7505 10.9160 2.3306 22.9616 4.4824
temp: 298.150 k
press: 1.00000 atm
elementType: 16 8 8 8 7 7 6 6 6 6 6 6 6 6 6 6 6 6 6 6 1 1 1 1 1 1 1 1 1 1 1 1 1 1 1 1 1 1 1 1
symmnumber: 1
zpe: 843657.5 jmol-1
zpe.correction: 0.321332 hartree
zpe.thermalcorrener: 0.342670 hartree
zpe.thermalcorrenthalpy: 0.343614 hartree
zpe.thermalcorrgfe: 0.267933 hartree
zpe.sumelectzpe: -1277.202029 hartree
zpe.sumelectthermal: -1277.180691 hartree
zpe.sumelectthermalent: -1277.179747 hartree
zpe.sumelectthermalfe: -1277.255428 hartree
dipole: -0.2788 4.3010 0.5671
dipole: 4.3471
quadrupole: -101.7863 -137.2742 -114.6349
quadrupole: -0.2845 -2.6371 0.1961
quadrupole: 16.1122 -19.3757 3.2636 -0.2845 -2.6371 0.1961
hfenergy: -1277.5233608 hartree
pointgroup: C01 [X(C14H20N2O3S1)]
dipole: 0.032515 -1.4674265 0.8779057 debye
polarizability: 211.3790417|4.2627211|190.580668|2.2674016|-12.8293223|166.2409722 unknown
InChI: InChI=1S/C14H20N2O3S/c1-10(2)16(11-6-4-3-5-7-11)13(17)9-20-8-12(15)14(18)19/h3-7,10,12,18H,8-9,15H2,1-2H3
charge 0 multiplicity 1
40 atoms
S  1.921051 0.989531 -1.946472
O  -0.458713 2.582309 -1.310562
O  4.331752 0.081144 1.837303
O  2.236242 -0.620463 1.143793
N  -1.880583 0.97605 -0.378978
N  5.109702 -1.296173 -0.522189
C  -2.910707 2.022514 -0.06073
C  -2.129395 -0.404511 -0.01489
C  -3.116634 2.154235 1.464528
C  -4.241275 1.766939 -0.801541
C  -0.68376 1.376017 -0.988648
C  0.32645 0.25541 -1.243489
C  3.057069 -0.503436 -1.655281
C  -1.654255 -0.917264 1.218186
C  -2.846727 -1.252239 -0.895916
C  4.069159 -0.239909 -0.526144
C  -1.899522 -2.263877 1.566885
C  -3.093861 -2.597805 -0.542856
C  -2.621736 -3.106381 0.68962
C  3.403203 -0.285429 0.85315
H  -2.458634 2.954514 -0.445685
H  -3.822073 2.978691 1.674728
H  -3.536214 1.228525 1.899063
H  -2.162311 2.381186 1.971807
H  -4.080026 1.697091 -1.891928
H  -4.935121 2.605983 -0.611432
H  -4.729635 0.838492 -0.454086
H  0.589945 -0.267887 -0.310486
H  -0.082765 -0.478144 -1.960028
H  2.447978 -1.394125 -1.434776
H  3.599823 -0.671966 -2.601591
H  -1.086155 -0.263068 1.888032
H  -3.198179 -0.853071 -1.853336
H  4.475144 0.791578 -0.651015
H  -1.521643 -2.655093 2.517741
H  -3.647925 -3.247215 -1.229689
H  -2.810089 -4.15088 0.961422
H  5.531895 -1.457446 -1.441352
H  5.803968 -1.189524 0.223961
H  3.910257 0.015698 2.736778
