program: Gaussian 09
title: 000129830
version: EM64L-G09RevD.01
frameworkgroup: C1[X(C10H7N3O6S2)]
method: RPBEPBE
basis: SDD
operation: Freq
keyword: #p
keyword: freq=noraman
keyword: PBEPBE/SDD
title: #p freq=noraman PBEPBE/SDD
converged: YES YES NO NO
title: Mulliken charges:
elementType: S S O O O O O O N N N C C C C C C C C C C H H H H H H H
charge: 0.981414 0.991627 -0.561021 -0.565350 -0.483212 -0.482191 -0.493963 -0.494135 -0.054953 0.031504 -0.021722 0.422857 0.430926 -0.234486 -0.428920 -0.389260 -0.080495 -0.551496 0.372710 -0.385898 -0.228264 0.307445 0.302604 0.280113 0.264672 0.289449 0.392540 0.387505
chargesum: 0.00000
title: Mulliken charges with hydrogens summed into heavy atoms:
elementType: S S O O O O O O N N N C C C C C C C C C C
charge: 0.981414 0.991627 -0.168481 -0.177844 -0.483212 -0.482191 -0.493963 -0.494135 -0.054953 0.031504 -0.021722 0.422857 0.430926 -0.234486 -0.121476 -0.086657 -0.080495 -0.271383 0.372710 -0.121226 0.061185
polarizability: 4.03830524e+02 -2.48809341e+00 1.89637324e+02 1.71445913e+00 1.03488412e+00 1.11497625e+02
1716.lowfreq: -6.7557 -0.0020 0.0010 0.0011 1.3657 5.0896 23.7012 31.8360 66.5832
frequency: 23.6948 31.7846 66.5827 74.4224 76.8678 90.8361 125.7705 134.1202 143.6382 159.2605 165.6564 184.9755 196.5529 210.3781 221.6453 253.1516 280.5493 283.1599 301.4184 310.4313 325.6360 341.7270 346.1966 378.2591 401.0229 405.8579 436.0347 446.9230 459.2323 484.2780 503.8650 533.9628 542.4733 585.5802 599.9995 619.4452 640.8227 694.6991 705.1165 778.7223 792.1430 831.2471 833.8360 834.6678 883.8930 900.4410 927.2432 941.7363 954.8265 969.4516 970.8791 990.2064 1046.8338 1049.6941 1058.8123 1091.1367 1152.1577 1221.3817 1226.9367 1268.9820 1286.4618 1369.0096 1374.9963 1419.4315 1439.7274 1448.7502 1489.8610 1561.2840 1589.6578 1625.1405 2073.4301 3137.3577 3149.2034 3151.3092 3162.4765 3173.1773 3480.2836 3481.3766
redmass: 10.1377 9.8747 5.8415 8.1885 10.8431 9.6801 10.8610 8.7818 11.2826 6.3771 5.4351 1.8432 5.1198 3.3533 6.1564 3.0412 7.5129 2.3101 6.6361 6.7274 7.2456 7.4559 10.1364 6.9559 8.6361 9.3980 5.2088 9.5172 7.8471 2.8414 6.9211 11.0822 13.6089 7.8757 5.8486 8.1193 7.8399 5.3857 7.0404 2.4705 4.6356 4.4847 4.7727 2.2933 7.4665 1.3421 1.6716 5.3867 1.6280 16.6842 13.4878 1.3981 1.3116 1.1795 1.9010 2.9090 1.4008 2.0197 1.3346 2.8886 1.5092 3.8021 4.2863 4.7747 10.1509 3.0613 4.8499 6.5705 7.4540 7.1211 13.9666 1.0922 1.0898 1.0927 1.0922 1.0973 1.0662 1.0662
irintensity: 1.6836 0.7034 0.3559 0.5242 0.6557 0.8546 0.0682 1.3793 1.4501 2.4358 25.7758 24.9438 13.4067 18.0127 3.2274 72.1058 5.3260 21.7891 44.2915 50.2320 17.4922 6.9877 47.1920 3.8213 22.2097 49.7406 4.6431 58.5507 14.1052 15.6327 19.7337 194.8749 20.5083 17.3623 68.6073 7.6221 67.8034 1.0660 0.2257 0.6188 4.3914 93.4840 48.7874 33.0380 1.2577 0.5452 50.7063 22.9214 31.3191 114.9922 20.9448 4.3599 58.6997 66.4473 84.6228 22.9537 15.5666 1.0965 31.2960 8.5008 3.5414 100.8559 6.5619 5.8908 2.2141 101.3925 57.7408 24.7185 48.0261 124.7815 661.1544 9.5116 3.5576 6.4827 0.8199 5.5097 56.0623 65.7195
temp: 298.150 k
press: 1.00000 atm
elementType: 16 16 8 8 8 8 8 8 7 7 7 6 6 6 6 6 6 6 6 6 6 1 1 1 1 1 1 1
symmnumber: 1
zpe: 436183.5 jmol-1
zpe.correction: 0.166134 hartree
zpe.thermalcorrener: 0.187070 hartree
zpe.thermalcorrenthalpy: 0.188014 hartree
zpe.thermalcorrgfe: 0.115674 hartree
zpe.sumelectzpe: -1795.059341 hartree
zpe.sumelectthermal: -1795.038404 hartree
zpe.sumelectthermalent: -1795.037460 hartree
zpe.sumelectthermalfe: -1795.109801 hartree
dipole: -0.3400 3.4416 0.1770
dipole: 3.4629
quadrupole: -154.3693 -134.9765 -142.4994
quadrupole: 1.5831 21.2719 0.8487
quadrupole: -10.4209 8.9719 1.4490 1.5831 21.2719 0.8487
hfenergy: -1795.2254743 hartree
pointgroup: C01 [X(C10H7N3O6S2)]
dipole: -0.146785 1.3356031 0.2252243 debye
polarizability: 403.5441701|-1.8920427|188.2801971|9.5525893|10.1396758|113.1411067 unknown
InChI: InChI=1S/C10H7N3O6S2/c11-13-12-9-4-6-1-2-8(20(14,15)16)3-7(6)5-10(9)21(17,18)19/h1-5,14,17H
charge 0 multiplicity 1
28 atoms
S  -3.155169 -1.652999 -0.123415
S  4.792632 -0.604845 -0.109811
O  -3.828254 -1.017709 -1.731768
O  5.013687 -0.858288 1.71591
O  -2.543705 -3.13374 -0.320061
O  -4.245218 -1.374403 1.038811
O  4.727109 -2.046604 -0.839141
O  5.834685 0.53101 -0.600656
N  -3.154107 1.737309 0.23465
N  -4.330875 1.332207 -0.0021
N  -5.495312 1.223878 -0.16594
C  0.680786 -0.177502 -0.022428
C  0.518046 1.246085 0.200665
C  -1.74668 -0.413214 -0.048549
C  -0.48657 -0.988852 -0.144004
C  1.994566 -0.738577 -0.105673
C  3.073496 0.12101 0.027802
C  -0.79314 1.792445 0.273475
C  -1.951679 1.001222 0.142914
C  1.686364 2.073525 0.327251
C  2.963718 1.522412 0.244773
H  -0.400459 -2.070607 -0.301673
H  2.144059 -1.809457 -0.281526
H  -0.935838 2.867185 0.422809
H  1.564969 3.149253 0.491502
H  3.86592 2.135863 0.325156
H  -4.715645 -1.451975 -1.896805
H  5.932315 -1.22843 1.865933
