program: Gaussian 09
title: 000129815
version: EM64L-G09RevD.01
frameworkgroup: C1[X(C13H20N2O2)]
method: RPBEPBE
basis: SDD
operation: Freq
keyword: #p
keyword: freq=noraman
keyword: PBEPBE/SDD
title: #p freq=noraman PBEPBE/SDD
converged: YES YES NO NO
title: Mulliken charges:
elementType: O O N N C C C C C C C C C C C C C H H H H H H H H H H H H H H H H H H H H
charge: -0.432994 -0.477373 -0.348644 -0.705968 -0.107194 -0.345823 -0.465812 -0.516254 0.466549 0.178230 -0.045208 0.148680 -0.441082 0.123285 -0.689035 -0.709391 -0.394938 0.188195 0.191085 0.237841 0.203556 0.199309 0.237490 0.237670 0.206016 0.237347 0.324119 0.219693 0.201376 0.213206 0.197161 0.206691 0.239104 0.210140 0.337126 0.316528 0.359318
chargesum: 0.00000
title: Mulliken charges with hydrogens summed into heavy atoms:
elementType: O O N N C C C C C C C C C C C C C
charge: -0.108875 -0.118055 -0.110973 -0.052314 0.081001 -0.154738 -0.024415 -0.079455 0.466549 0.178230 0.160808 0.148680 -0.203734 0.123285 -0.054760 -0.066434 -0.184798
polarizability: 1.99536495e+02 1.22069841e+01 1.58959663e+02 1.44893003e+01 -1.71145148e+01 1.29684732e+02
1716.lowfreq: -6.6091 -0.0004 0.0006 0.0008 6.5072 7.7574 22.1405 34.4708 57.4790
frequency: 21.8886 34.2554 57.4655 93.8823 132.6733 138.3618 187.5017 204.2742 213.0293 229.7068 245.8309 268.0625 278.9101 286.0351 290.1899 307.7299 316.5905 317.4265 351.8790 392.7522 399.3246 426.8711 450.7035 471.2845 487.4852 500.6648 511.1643 527.7531 566.8288 620.0580 631.7732 679.2948 701.3776 725.2205 770.4867 787.8464 823.9351 845.5319 879.0006 886.9478 895.0855 910.2085 914.5812 934.3413 963.2085 993.2435 1005.4761 1056.3105 1077.9752 1097.7391 1116.7313 1130.7572 1145.9062 1156.4104 1171.5279 1174.5976 1190.6072 1202.3734 1222.4239 1229.9141 1246.8257 1292.8814 1295.3183 1304.0118 1316.1309 1333.1296 1349.0895 1357.6703 1366.1985 1370.7613 1385.9365 1391.4839 1420.0056 1440.0292 1457.1601 1462.1454 1463.6056 1465.5212 1482.0253 1482.9140 1484.2267 1502.8232 1595.8165 1617.4945 1633.9363 2825.1358 2907.5983 2945.8590 2965.8875 2971.4419 2981.1476 2987.3220 3003.7823 3053.3189 3059.9232 3065.9524 3069.9837 3092.6384 3111.7973 3147.0141 3425.9021 3515.4742 3573.6471 3608.9992 3722.9992
redmass: 2.7311 4.3490 3.5958 4.3576 3.9160 4.1137 2.7509 1.0794 2.8212 2.5216 1.5464 2.1440 2.1990 1.4220 1.3080 1.3667 3.1820 2.2262 2.6616 3.6175 2.8109 2.5961 2.8980 3.9087 1.0840 4.3797 3.2849 2.0833 4.0615 3.1313 3.2001 4.9611 3.0759 3.5370 2.0505 2.3586 2.4324 3.8470 2.3893 1.7582 1.9289 1.3230 2.2021 1.4324 3.0307 2.7870 2.0830 2.3375 1.7258 1.7501 1.8628 2.0751 1.2978 1.5448 1.3399 1.7678 1.9227 1.4493 1.6510 1.5032 2.8350 1.2351 1.3478 1.7260 1.4141 1.4149 1.6711 1.7269 1.4229 1.2493 1.2386 1.7895 4.5413 1.1842 1.1442 1.0589 1.0723 1.0837 1.2122 2.4217 1.1365 3.9809 2.4988 2.1863 3.7135 1.0801 1.0840 1.0582 1.0352 1.0413 1.0797 1.0936 1.0675 1.1023 1.0984 1.0994 1.0978 1.1001 1.0882 1.0954 1.0738 1.0655 1.0446 1.0662 1.1038
irintensity: 0.1356 0.0808 0.0334 2.8490 0.4652 0.1736 0.7592 0.1873 1.2796 5.4112 2.2256 30.0790 56.8756 92.0404 127.9623 78.5202 32.1545 63.1085 29.8572 2.0820 4.7155 3.8651 0.6998 4.0529 73.0812 12.5782 1.5562 78.2386 8.8898 8.4138 14.1111 6.1550 11.5816 7.1200 24.6275 48.9296 2.3179 4.2887 1.4944 20.7441 24.1332 0.9730 19.2182 2.4398 21.9174 18.8613 8.9331 86.7896 126.8095 59.9313 1.1088 30.6762 46.4975 20.3689 29.9410 43.5969 37.2174 39.9245 3.0378 6.8093 12.7468 11.1572 4.1735 54.6422 4.6641 17.4503 22.1106 26.2246 5.2781 18.4918 16.8969 40.9850 2.8323 12.8335 16.2243 11.5739 5.2797 4.1736 3.9776 27.2062 14.6656 100.3137 32.9659 65.1906 145.3602 117.9438 70.7769 30.3501 30.8290 25.0195 24.4720 16.3425 60.4499 34.5939 3.1767 43.0821 88.3859 37.6596 20.2189 14.3763 2.0922 14.2871 69.1140 39.2662 34.7658
temp: 298.150 k
press: 1.00000 atm
elementType: 8 8 7 7 6 6 6 6 6 6 6 6 6 6 6 6 6 1 1 1 1 1 1 1 1 1 1 1 1 1 1 1 1 1 1 1 1
symmnumber: 1
zpe: 820664.4 jmol-1
zpe.correction: 0.312575 hartree
zpe.thermalcorrener: 0.330409 hartree
zpe.thermalcorrenthalpy: 0.331353 hartree
zpe.thermalcorrgfe: 0.267320 hartree
zpe.sumelectzpe: -766.017385 hartree
zpe.sumelectthermal: -765.999550 hartree
zpe.sumelectthermalent: -765.998606 hartree
zpe.sumelectthermalfe: -766.062639 hartree
dipole: 1.7048 -0.8527 -0.8964
dipole: 2.1064
quadrupole: -87.0732 -99.0268 -100.0585
quadrupole: 4.8470 5.7100 -8.7124
quadrupole: 8.3130 -3.6406 -4.6724 4.8470 5.7100 -8.7124
hfenergy: -766.3299596 hartree
pointgroup: C01 [X(C13H20N2O2)]
dipole: -0.6817033 0.2900728 -0.3714007 debye
polarizability: 198.6499573|11.8655783|162.1397294|-16.7085316|13.8794959|127.3912035 unknown
InChI: InChI=1S/C13H20N2O2/c1-7(2)15-10-5-3-8-9(13(10)17)4-6-11(16)12(8)14/h4,6-7,10,13,15-17H,3,5,14H2,1-2H3
charge 0 multiplicity 1
37 atoms
O  -0.392311 -2.80664 1.010378
O  4.341138 1.081559 -0.665123
N  -2.265942 0.044332 -0.565349
N  2.417336 2.228147 0.79681
C  -1.802915 -0.813216 0.543612
C  -0.638361 -1.704273 0.039766
C  -1.296646 0.015976 1.743494
C  -0.174258 0.980552 1.313921
C  0.674686 -0.963671 -0.135827
C  0.894987 0.301577 0.471407
C  -3.468461 0.891127 -0.366751
C  2.135478 0.97089 0.260804
C  1.682767 -1.565187 -0.923914
C  3.138755 0.338308 -0.525953
C  -4.768957 0.096812 -0.05698
C  -3.648362 1.777221 -1.616833
C  2.923901 -0.919549 -1.113955
H  -2.603317 -1.506287 0.914363
H  -0.935039 -2.157246 -0.935583
H  -0.913942 -0.701151 2.494598
H  -2.123854 0.579961 2.214357
H  0.280174 1.425762 2.224058
H  -0.615928 1.81336 0.72746
H  -2.306734 -0.462984 -1.460497
H  -3.259792 1.555835 0.495558
H  1.502366 -2.547153 -1.37368
H  -1.215628 -3.360964 1.058622
H  -4.648104 -0.55209 0.830197
H  -5.046937 -0.542521 -0.917199
H  -5.611956 0.784632 0.143839
H  -3.837676 1.154265 -2.513747
H  -4.506526 2.463152 -1.498655
H  -2.736999 2.372055 -1.800595
H  3.70981 -1.38932 -1.719726
H  3.327317 2.640604 0.611223
H  1.723006 2.748326 1.320364
H  4.997523 0.581601 -1.207364
