program: Gaussian 09
title: 000129847
version: EM64L-G09RevD.01
frameworkgroup: C1[X(C12H4Br6ClO3P)]
method: RPBEPBE
basis: SDD
operation: Freq
keyword: #p
keyword: freq=noraman
keyword: PBEPBE/SDD
title: #p freq=noraman PBEPBE/SDD
converged: NO YES NO NO
title: Mulliken charges:
elementType: Br Br Br Br Br Br Cl P O O O C C C C C C C C C C C C H H H H
charge: 0.098665 0.103292 0.110822 0.111695 0.063824 0.059797 -0.094944 1.080452 -0.493532 -0.484865 -0.478753 0.584891 0.616896 -0.354827 -0.346156 -0.310169 -0.356927 -0.137869 -0.145598 -0.128969 -0.147245 -0.239715 -0.232637 0.280758 0.279281 0.279984 0.281848
chargesum: 0.00000
title: Mulliken charges with hydrogens summed into heavy atoms:
elementType: Br Br Br Br Br Br Cl P O O O C C C C C C C C C C C C
charge: 0.098665 0.103292 0.110822 0.111695 0.063824 0.059797 -0.094944 1.080452 -0.493532 -0.484865 -0.478753 0.584891 0.616896 -0.354827 -0.346156 -0.310169 -0.356927 0.142889 0.133683 0.151015 0.134604 -0.239715 -0.232637
polarizability: 3.61454385e+02 -3.20227392e+01 3.10431288e+02 4.77554024e+00 -5.48628251e+00 2.30794864e+02
1716.lowfreq: -1.7135 -0.0017 -0.0016 -0.0011 2.5236 3.6470 6.9206 13.2442 18.0735
frequency: 5.9996 13.2222 18.0616 26.5826 39.7151 48.0022 48.8652 85.0538 90.3541 107.1554 110.7029 112.7997 114.1226 118.6217 127.1474 148.5175 156.1588 177.2282 180.1714 222.3691 223.2680 226.3733 237.9560 270.3943 277.9969 298.8195 314.0880 349.4569 351.7517 355.6633 409.4808 442.0208 500.7254 502.2616 503.0366 515.7766 518.7821 529.7313 568.0201 573.6956 674.1768 694.2729 711.2389 714.0373 728.9378 732.1380 822.9407 833.3791 866.2604 867.3958 875.4002 876.8191 1026.4787 1029.7978 1057.4796 1094.0760 1095.8899 1187.7088 1188.6969 1196.8303 1198.2488 1337.7305 1338.3596 1358.2069 1359.1179 1395.6612 1396.3768 1535.3990 1536.4753 1548.5515 1550.2833 3185.1259 3185.9545 3187.1702 3187.9346
redmass: 42.3878 41.3030 41.7834 46.2312 41.1732 35.9738 38.3477 33.4803 19.6096 15.9584 42.5563 32.4301 20.9540 24.7402 13.8991 30.3547 18.5576 4.6104 4.5879 36.8378 69.3891 19.6646 14.9291 16.9175 13.8486 11.8068 13.3098 9.4241 7.8426 10.3301 12.3427 15.7386 15.1158 5.0878 5.2016 7.5359 8.4634 9.1132 4.0138 4.3846 13.5585 13.5767 10.2680 10.3024 6.9423 7.0269 7.7455 8.0352 1.4338 1.4454 1.3690 1.3670 6.2909 6.0346 15.9394 2.5628 2.6621 1.5941 1.6015 3.3335 3.2635 4.5295 4.5115 4.6924 4.5618 3.0250 3.0098 9.4783 9.4631 7.7144 7.7116 1.0931 1.0932 1.0939 1.0940
irintensity: 0.0134 0.0410 0.0310 0.0826 0.0396 0.0464 0.0380 0.2634 0.0502 0.0746 0.0479 0.2040 0.3312 0.3041 0.4773 0.7025 0.0708 0.0129 0.0054 1.4792 0.2610 3.3773 8.5948 7.2538 0.6893 14.6460 29.6389 8.2348 1.6476 33.0848 10.9233 53.2411 56.7456 0.2403 0.6252 14.8953 31.6618 50.8125 5.5409 1.4629 102.3450 156.3330 19.0804 85.1653 20.1861 30.7845 2.5808 16.2095 30.3026 27.5318 0.7793 0.1030 56.3966 14.8323 65.2282 45.2228 25.3014 10.1843 14.6438 57.7758 13.4320 8.0543 19.1511 22.6751 43.9148 107.4204 117.6223 20.3248 115.1245 132.2792 135.2693 1.1558 1.0666 0.4481 0.4049
temp: 298.150 k
press: 1.00000 atm
elementType: 35 35 35 35 35 35 17 15 8 8 8 6 6 6 6 6 6 6 6 6 6 6 6 1 1 1 1
symmnumber: 1
zpe: 337913.4 jmol-1
zpe.correction: 0.128704 hartree
zpe.thermalcorrener: 0.154349 hartree
zpe.thermalcorrenthalpy: 0.155293 hartree
zpe.thermalcorrgfe: 0.064054 hartree
zpe.sumelectzpe: -1565.715364 hartree
zpe.sumelectthermal: -1565.689719 hartree
zpe.sumelectthermalent: -1565.688775 hartree
zpe.sumelectthermalfe: -1565.780015 hartree
dipole: -0.1562 -2.4198 -2.3561
dipole: 3.3810
quadrupole: -189.3192 -201.4216 -206.4600
quadrupole: -3.3549 3.0817 -6.2191
quadrupole: 9.7477 -2.3547 -7.3931 -3.3549 3.0817 -6.2191
hfenergy: -1565.8440686 hartree
pointgroup: C01 [X(C12H4Br6Cl1O3P1)]
dipole: -0.1214604 1.294239 0.2821109 debye
polarizability: 357.518836|27.4252173|285.7408891|-21.8438272|-40.0906849|259.4208124 unknown
InChI: InChI=1S/C12H4Br6O3P.Cl/c13-5-1-7(15)11(8(16)2-5)20-22(19)21-12-9(17)3-6(14)4-10(12)18;/h1-4H;
charge 0 multiplicity 1
27 atoms
Br -3.133696 -1.68234 2.328787
Br 1.662392 -0.664977 2.987903
Br -0.347929 1.340783 -1.801847
Br 2.871036 -1.19452 -2.681358
Br -5.978336 2.232029 -0.840012
Br 5.038598 3.228015 0.358733
Cl -0.355162 -3.955608 0.907767
P  -0.053221 -2.114628 -0.332116
O  -0.742875 -0.730139 0.551265
O  1.632655 -1.909795 0.121786
O  -0.498755 -2.279003 -1.836728
C  -1.942353 -0.104057 0.179232
C  2.338022 -0.696982 0.146842
C  -3.137096 -0.367287 0.902362
C  2.505372 -0.001201 1.373848
C  -1.971946 0.889663 -0.836028
C  3.020057 -0.22501 -1.00625
C  -4.33335 0.318387 0.610804
C  3.301052 1.160368 1.445725
C  -3.157723 1.584272 -1.146919
C  3.821586 0.932933 -0.954121
C  -4.326562 1.28211 -0.41868
C  3.940874 1.615434 0.274533
H  -5.243121 0.103238 1.175147
H  3.419502 1.688889 2.393974
H  -3.162979 2.343164 -1.932116
H  4.341455 1.285363 -1.847531
