program: Gaussian 09
title: 000129810
version: EM64L-G09RevD.01
frameworkgroup: C1[X(C10H16N4O4)]
method: RPBEPBE
basis: SDD
operation: Freq
keyword: #p
keyword: freq=noraman
keyword: PBEPBE/SDD
title: #p freq=noraman PBEPBE/SDD
converged: YES YES NO NO
title: Mulliken charges:
elementType: O O O O N N N N C C C C C C C C C C H H H H H H H H H H H H H H H H
charge: -0.244650 -0.423490 -0.250832 -0.163627 -0.121476 -0.112837 -0.028450 0.077404 -0.379202 -0.104256 -0.344938 -0.343928 -0.413649 -0.332908 -0.311859 0.178396 -0.114716 -0.298349 0.229350 0.181849 0.271926 0.202267 0.240935 0.204691 0.198292 0.210540 0.296032 0.211657 0.218915 0.214910 0.190810 0.327604 0.267906 0.265683
chargesum: 0.00000
title: Mulliken charges with hydrogens summed into heavy atoms:
elementType: O O O O N N N N C C C C C C C C C C
charge: -0.244650 -0.095886 -0.250832 -0.163627 -0.121476 -0.112837 -0.028450 0.077404 0.031997 0.167670 0.098265 0.059054 0.092923 0.097663 0.093861 0.178396 0.153189 -0.032666
polarizability: 1.91716391e+02 -4.92767057e+00 1.69308461e+02 9.42050078e-01 -1.25710510e+01 1.01876300e+02
1716.lowfreq: -0.0004 0.0005 0.0007 3.4368 7.4297 11.9524 24.5748 35.1375 45.0698
frequency: 22.8028 35.0466 45.0623 57.1494 77.7769 101.6621 123.5074 154.1959 178.2581 232.9317 242.5942 269.6103 282.2757 292.9578 312.5550 325.1302 355.5843 392.8937 422.6259 445.8535 464.0024 474.1707 494.5504 545.6556 607.0839 617.8641 630.3220 699.4439 726.1690 763.6656 768.1539 773.3026 810.9123 825.8368 842.5440 860.4024 882.7687 893.7112 916.0609 993.9568 1003.5763 1026.1924 1048.7281 1054.0267 1058.8633 1082.1587 1088.6530 1105.3466 1116.4474 1133.2366 1139.3722 1144.6030 1168.7198 1192.3014 1217.0789 1236.4169 1260.7673 1267.6837 1277.9913 1294.0626 1298.4887 1312.6472 1330.8679 1336.2188 1343.9806 1354.1935 1356.8073 1364.7043 1369.5685 1370.4419 1378.6626 1387.1604 1414.9486 1444.3167 1447.1718 1449.9586 1452.7055 1458.0230 1469.9479 1475.5778 2872.1871 2879.2734 2888.3134 2952.0370 2974.0211 2974.6871 3014.5694 3019.8385 3068.0300 3079.7447 3085.8325 3093.2275 3111.6643 3234.2929 3260.3251 3529.8314
redmass: 6.2626 5.5511 9.3895 4.0266 5.5480 6.6659 4.2853 4.5366 5.9266 5.4239 1.8496 6.9715 2.4804 1.7782 2.2215 2.3366 3.1588 2.0040 6.1271 2.2497 3.6803 3.1720 4.9435 4.8274 1.9526 4.7772 4.2844 11.7752 4.9151 3.7405 3.8254 1.6028 3.8059 2.9900 1.5994 1.4495 5.4692 2.3887 1.9788 2.2241 2.7175 2.1962 3.1036 1.9024 1.8470 2.2442 3.0275 2.3037 3.0664 2.3450 2.7744 3.3212 1.7805 1.0674 1.2840 3.2020 1.5241 1.4384 1.3848 1.6063 1.9432 1.2331 1.3062 3.0605 1.2298 2.3294 4.0075 1.6199 1.7547 1.4399 1.2793 1.4160 2.9130 1.0860 1.1367 1.5917 1.1228 1.1255 1.1194 1.6670 1.0681 1.0694 1.0674 1.0667 1.0788 1.0787 1.0655 1.0906 1.0896 1.0966 1.0858 1.0984 1.0982 1.0926 1.1079 1.0659
irintensity: 0.8998 0.1947 0.9757 0.3405 6.7197 0.2385 3.5409 3.1014 2.4601 1.4592 3.8631 1.7056 1.9778 57.6483 89.0163 2.4086 6.6021 0.7258 8.4097 2.1855 10.8293 5.3719 1.9072 8.1007 9.1425 15.3559 2.3300 0.9392 23.4933 22.8923 9.0362 33.5668 28.2358 11.3401 0.4238 9.4981 5.2681 7.0145 8.7713 26.0055 43.5457 12.3927 22.9128 8.0308 58.2831 18.0871 45.0001 21.0807 9.9479 30.8066 15.8410 133.5450 2.5606 1.4125 13.3526 48.0049 7.6125 18.0573 10.8665 50.3296 107.4623 5.7388 1.4568 77.5660 11.7983 39.0716 157.2861 87.8370 6.3883 10.5661 10.4056 6.9357 6.6143 3.8905 1.5580 17.0966 12.9804 3.9347 12.1009 9.7995 39.7322 36.9603 187.6232 60.0693 46.9588 38.7291 14.5104 55.0606 12.1494 42.2815 12.5988 31.3230 9.8091 2.3865 0.7601 5.5303
temp: 298.150 k
press: 1.00000 atm
elementType: 8 8 8 8 7 7 7 7 6 6 6 6 6 6 6 6 6 6 1 1 1 1 1 1 1 1 1 1 1 1 1 1 1 1
symmnumber: 1
zpe: 710172.3 jmol-1
zpe.correction: 0.270490 hartree
zpe.thermalcorrener: 0.287463 hartree
zpe.thermalcorrenthalpy: 0.288407 hartree
zpe.thermalcorrgfe: 0.224010 hartree
zpe.sumelectzpe: -909.025838 hartree
zpe.sumelectthermal: -909.008865 hartree
zpe.sumelectthermalent: -909.007921 hartree
zpe.sumelectthermalfe: -909.072318 hartree
dipole: -1.3994 -7.5263 2.7120
dipole: 8.1215
quadrupole: -120.3294 -109.7753 -104.6652
quadrupole: -6.2271 3.6798 -6.6434
quadrupole: -8.7395 1.8147 6.9247 -6.2271 3.6798 -6.6434
hfenergy: -909.2963281 hartree
pointgroup: C01 [X(C10H16N4O4)]
dipole: 0.5566707 3.0151347 0.8992579 debye
polarizability: 191.6385702|-4.477295|170.3139942|-3.8712438|9.2959805|100.9485879 unknown
InChI: InChI=1S/C10H16N4O4/c15-9(7-12-3-5-18-6-4-12)8-13-2-1-11-10(13)14(16)17/h1-2,9,15H,3-8H2
charge 0 multiplicity 1
34 atoms
O  4.464463 -1.210332 0.121087
O  -0.780772 2.681064 -1.144448
O  -0.448074 -1.706346 -0.193617
O  -2.27297 -3.065922 0.05991
N  2.253691 0.664569 -0.046082
N  -2.014778 0.532943 0.584034
N  -3.882969 -0.765447 0.304074
N  -1.718357 -1.908761 0.05023
C  1.461552 1.806292 -0.547457
C  -0.052445 1.496413 -0.655792
C  2.427808 -0.415867 -1.059458
C  3.574733 1.074014 0.503584
C  -0.615042 1.002323 0.694613
C  3.154145 -1.610718 -0.423985
C  4.279698 -0.14733 1.118652
C  -2.532061 -0.745185 0.312607
C  -3.124396 1.353234 0.741832
C  -4.260828 0.541436 0.567921
H  1.802189 2.17016 -1.548316
H  1.595284 2.649534 0.164769
H  -0.244972 0.733078 -1.425802
H  3.013365 -0.044689 -1.936775
H  1.439334 -0.755341 -1.411462
H  3.418537 1.842755 1.284966
H  4.232163 1.511398 -0.288696
H  -0.599286 1.825664 1.433408
H  0.030266 0.187107 1.054065
H  2.521807 -2.040365 0.380778
H  3.371717 -2.38632 -1.175718
H  5.292803 0.113983 1.466992
H  3.678304 -0.530641 1.971592
H  -0.472368 3.479467 -0.641453
H  -3.020252 2.414677 0.947321
H  -5.308291 0.828654 0.609525
