program: Gaussian 09
title: 000129881
version: EM64L-G09RevD.01
frameworkgroup: C1[X(C23H22N2O2S)]
method: RPBEPBE
basis: SDD
operation: Freq
keyword: #p
keyword: freq=noraman
keyword: PBEPBE/SDD
title: #p freq=noraman PBEPBE/SDD
converged: YES YES NO NO
title: Mulliken charges:
elementType: S O O N N C C C C C C C C C C C C C C C C C C C C C C C H H H H H H H H H H H H H H H H H H H H H H
charge: 0.977453 -0.548772 -0.502161 0.019071 -0.488462 -0.282644 -0.476330 -0.595919 -0.039368 0.377814 0.114193 0.552314 -0.430106 -0.357262 -0.457912 -0.379295 -0.231369 -0.269642 -0.233492 -0.233161 -0.249394 -0.094559 -0.185100 -0.255538 0.444235 -0.381787 -0.363186 -0.800783 0.233284 0.230962 0.231993 0.219900 0.229628 0.239068 0.304762 0.222006 0.235649 0.233190 0.237443 0.307370 0.223291 0.224961 0.228190 0.291743 0.288273 0.243925 0.243542 0.245446 0.228609 0.227925
chargesum: 0.00000
title: Mulliken charges with hydrogens summed into heavy atoms:
elementType: S O O N N C C C C C C C C C C C C C C C C C C C C C C C
charge: 0.977453 -0.548772 -0.502161 0.019071 -0.181092 -0.049360 -0.013374 -0.146390 -0.039368 0.377814 0.114193 0.552314 -0.191038 -0.052500 -0.235906 -0.143646 0.001822 -0.032200 -0.010201 -0.008200 -0.021203 -0.094559 0.106643 0.032735 0.444235 -0.137862 -0.119644 -0.098803
polarizability: 3.68708803e+02 -3.93268860e+01 2.92039981e+02 2.19045527e+00 8.11612368e+00 2.66380686e+02
1716.lowfreq: -7.4441 -3.7588 0.0004 0.0014 0.0018 7.5816 12.0388 15.8116 20.1154
frequency: 11.9318 15.4928 19.8793 30.1741 33.9790 45.5758 52.6520 70.9554 76.3791 91.7724 113.4713 129.1057 146.8546 154.9306 171.8667 212.9166 224.0217 244.4972 254.7287 261.5567 271.4449 291.2426 310.1393 322.8871 367.2988 376.3798 391.2749 403.5834 406.9018 413.7941 430.7648 455.3538 472.8726 478.6834 507.5309 519.8554 544.1088 554.1029 577.3282 587.3784 609.2036 619.4229 621.5342 651.3841 701.4015 705.6296 707.0667 738.9138 762.6198 769.6285 777.1228 780.8382 808.0035 816.0499 818.0696 823.3804 846.9006 852.4953 884.2250 904.7025 914.1482 935.9074 960.6547 961.4372 969.2913 973.6934 981.2452 989.1040 990.4411 991.9785 993.6021 994.9508 1010.1224 1026.5224 1035.6889 1046.8355 1048.4330 1050.9951 1053.0190 1083.1374 1110.1256 1119.1233 1132.1101 1164.7768 1171.5059 1178.4067 1184.8695 1188.2920 1199.5197 1205.9497 1212.4041 1217.9168 1250.3956 1257.0684 1267.3434 1296.9198 1297.8948 1313.9281 1327.0311 1335.1901 1349.6389 1377.5528 1381.2389 1384.3124 1391.3532 1398.5275 1441.3816 1442.5067 1458.7802 1471.1200 1471.9353 1472.0191 1473.2137 1478.1941 1483.0939 1537.5734 1575.0558 1591.8060 1593.9968 1594.3134 1607.4497 1613.6891 2961.8084 2962.1210 2979.7703 2996.7589 3042.5503 3059.8910 3062.0816 3090.8648 3108.2712 3119.2668 3121.5001 3131.0172 3131.5043 3133.5547 3136.4397 3142.7820 3144.5552 3158.0425 3161.8985 3163.7451 3175.5545 3191.2805
redmass: 5.4736 4.9059 5.3486 4.2523 4.0750 4.6247 1.0365 4.6728 5.9631 8.1109 4.4759 6.4917 5.8430 4.5616 3.6093 6.5065 7.6086 5.6331 4.6999 5.6198 3.0431 3.9160 4.3964 3.9263 5.2095 3.8225 6.8534 2.8201 2.8763 3.9610 4.2852 5.5627 3.3130 3.6673 3.2497 3.7534 4.4353 3.6667 4.8619 5.4253 3.5180 5.7859 6.9298 4.6857 3.0819 2.6355 2.2958 2.1332 2.2981 1.8536 4.7504 2.1320 2.9520 3.6790 3.5408 1.6288 1.2464 1.2485 1.7771 1.5885 1.5840 2.2323 1.8451 2.6342 1.4938 1.3900 1.4121 1.8941 2.4169 4.2382 1.4533 2.1806 1.8424 2.2693 2.3659 2.2574 1.5978 2.4651 2.3057 1.6206 2.1210 1.2918 2.1645 1.6657 1.0572 1.1046 1.1307 1.1172 1.5839 1.7231 1.9541 3.0468 1.7258 1.3445 1.6505 1.4546 1.2623 1.5979 1.3805 1.4013 1.5634 5.8676 6.5125 6.9600 2.9305 1.2201 2.2837 2.2052 1.2562 1.4626 1.3956 1.4114 1.0564 1.6570 2.1924 9.8965 6.4199 6.7389 6.0950 6.1483 6.3270 6.1698 1.0789 1.0700 1.0387 1.0611 1.0943 1.1032 1.0949 1.1001 1.0875 1.0865 1.0871 1.0908 1.0885 1.0889 1.0902 1.0956 1.0937 1.0961 1.1013 1.1005 1.0957 1.0745
irintensity: 1.2897 0.1518 0.7829 0.1567 0.3654 0.6182 0.3961 0.4713 1.4645 1.0350 0.4476 1.1408 4.8302 0.7526 1.5479 13.1951 4.2208 10.2321 0.4637 8.8003 3.7656 1.6491 2.2611 5.2136 50.6691 2.6760 8.9218 0.0584 0.8592 14.1074 1.0449 28.0069 19.8936 16.3161 77.3771 12.7502 39.5283 8.9379 7.8637 27.3280 8.0257 4.1461 0.1811 11.8499 5.1845 14.5319 44.9705 15.8171 76.2714 19.3989 7.5870 34.1105 97.5434 85.3079 15.9895 11.8219 2.3175 0.3315 7.3858 10.7832 15.9408 9.4605 20.7205 38.4868 9.1491 0.2750 1.4955 1.6635 1.4245 3.0591 0.0390 1.6269 13.7474 6.0668 0.1924 13.2194 25.0136 23.4701 4.2061 10.1550 4.3823 8.1957 1.5118 2.5990 0.0417 2.2990 8.3063 0.2295 4.6170 1.9658 5.6417 6.3035 3.6860 1.0535 0.7212 13.8165 3.8133 7.1139 2.5622 1.9558 1.9936 2.0363 0.7670 0.2538 10.7013 16.7647 5.6144 10.0006 15.5450 19.3035 17.6610 6.5889 11.7477 10.9120 24.4489 7.2725 2.4313 2.1955 3.8655 10.9033 8.3213 7.0500 26.1280 12.2169 25.9969 28.8725 40.1722 26.4495 16.9540 15.1520 12.0649 5.1727 10.2759 13.1203 4.6774 12.8546 7.7697 37.9374 18.4229 8.1958 26.6257 30.8597 2.8509 20.1176
temp: 298.150 k
press: 1.00000 atm
elementType: 16 8 8 7 7 6 6 6 6 6 6 6 6 6 6 6 6 6 6 6 6 6 6 6 6 6 6 6 1 1 1 1 1 1 1 1 1 1 1 1 1 1 1 1 1 1 1 1 1 1
symmnumber: 1
zpe: 1025500.2 jmol-1
zpe.correction: 0.390592 hartree
zpe.thermalcorrener: 0.416530 hartree
zpe.thermalcorrenthalpy: 0.417474 hartree
zpe.thermalcorrgfe: 0.330375 hartree
zpe.sumelectzpe: -1545.479811 hartree
zpe.sumelectthermal: -1545.453873 hartree
zpe.sumelectthermalent: -1545.452929 hartree
zpe.sumelectthermalfe: -1545.540028 hartree
dipole: 1.6143 3.2449 7.1087
dipole: 7.9793
quadrupole: -147.2569 -175.9018 -173.3099
quadrupole: -15.3836 -15.4374 -10.8084
quadrupole: 18.2326 -10.4122 -7.8204 -15.3836 -15.4374 -10.8084
hfenergy: -1545.870403 hartree
pointgroup: C01 [X(C23H22N2O2S1)]
dipole: 0.7845057 1.0271992 2.8608699 debye
polarizability: 360.0973965|-46.1862478|299.5158816|-0.7358731|10.356533|267.516191 unknown
InChI: InChI=1S/C23H22N2O2S/c1-17-11-14-20(15-12-17)28(26,27)25-24-23-21-10-6-5-9-19(21)13-16-22(23)18-7-3-2-4-8-18/h2-12,14-15,22,25H,13,16H2,1H3
charge 0 multiplicity 1
50 atoms
S  -2.004553 -1.922373 -1.837237
O  -2.209673 -3.540233 -1.765342
O  -2.31098 -1.068124 -3.176474
N  0.166006 -0.562201 -0.746271
N  -0.059127 -1.70734 -1.439473
C  1.204992 1.064279 0.698396
C  2.560828 1.392648 1.381265
C  3.111036 0.155892 2.125683
C  1.266373 -0.276292 -0.064335
C  3.37272 -0.96318 1.131952
C  2.46695 -1.143018 0.036302
C  0.730527 2.232403 -0.168993
C  4.505516 -1.799525 1.240305
C  2.759026 -2.139338 -0.943531
C  -0.304817 3.08681 0.28206
C  1.354572 2.517886 -1.410609
C  4.768064 -2.803472 0.280519
C  3.898452 -2.959622 -0.823212
C  -0.709639 4.203929 -0.485291
C  0.951449 3.628511 -2.181769
C  -0.081926 4.478721 -1.721131
C  -2.916401 -1.121535 -0.395946
C  -3.090907 0.272525 -0.399786
C  -3.405015 -1.963072 0.616549
C  -4.329457 0.038295 1.723801
C  -3.802852 0.843039 0.678084
C  -4.11941 -1.366067 1.678124
C  -5.1310 0.662948 2.851155
H  0.459012 0.925922 1.509194
H  2.412883 2.239261 2.076362
H  3.293518 1.721412 0.619484
H  2.371319 -0.167029 2.888351
H  4.039976 0.40582 2.669678
H  5.193335 -1.656638 2.082533
H  2.124525 -2.230955 -1.831377
H  -0.800112 2.871802 1.238002
H  2.14602 1.85667 -1.784336
H  5.650802 -3.444165 0.382497
H  4.110175 -3.711927 -1.590469
H  0.197892 -2.623009 -0.999214
H  -1.512404 4.855882 -0.121569
H  1.436505 3.829856 -3.143627
H  -0.396612 5.339664 -2.32152
H  -2.688745 0.886815 -1.210275
H  -3.250781 -3.045762 0.558219
H  -3.951823 1.928715 0.702803
H  -4.523223 -1.999435 2.476391
H  -6.20646 0.70271 2.590637
H  -5.041745 0.081574 3.785217
H  -4.806311 1.697824 3.056426
