program: Gaussian 09
title: 000129966
version: EM64L-G09RevD.01
frameworkgroup: C1[X(C24H27NO6)]
method: RPBEPBE
basis: SDD
operation: Freq
keyword: #p
keyword: freq=noraman
keyword: PBEPBE/SDD
title: #p freq=noraman PBEPBE/SDD
converged: YES YES NO NO
title: Mulliken charges:
elementType: O O O O O O N C C C C C C C C C C C C C C C C C C C C C C C C H H H H H H H H H H H H H H H H H H H H H H H H H H H
charge: -0.253980 -0.326489 -0.256975 -0.437285 -0.224066 -0.310554 -0.438775 -0.424681 0.340810 0.295214 0.160284 0.169111 -0.339273 -0.442421 -0.436403 -0.395971 -0.409824 -0.242377 -0.277344 -0.235083 -0.200640 -0.412595 -0.510677 -0.141724 0.304256 0.342892 -0.714304 -0.710321 -0.710428 0.176283 0.307255 0.249800 0.251282 0.228304 0.238264 0.257396 0.240313 0.238686 0.226695 0.239690 0.227236 0.221398 0.243994 0.255000 0.254004 0.271083 0.283994 0.389866 0.219340 0.270248 0.208763 0.227015 0.224224 0.206667 0.270854 0.207831 0.219270 0.384869
chargesum: 0.00000
title: Mulliken charges with hydrogens summed into heavy atoms:
elementType: O O O O O O N C C C C C C C C C C C C C C C C C C C C C C C C
charge: -0.253980 -0.326489 -0.256975 -0.052416 -0.224066 -0.310554 -0.048909 -0.174881 0.340810 0.295214 0.160284 0.169111 0.140313 -0.204157 -0.179007 -0.155658 -0.171138 -0.015682 -0.037654 -0.007847 0.020759 0.086399 0.014410 0.142270 0.304256 0.342892 -0.015954 -0.052415 -0.012473 0.176283 0.307255
polarizability: 3.11389995e+02 -1.58256422e+00 2.98910120e+02 5.15547503e+01 1.61519675e+01 2.29333917e+02
1716.lowfreq: -8.6988 -2.0994 -0.0005 -0.0005 0.0003 3.2820 8.7642 17.0154 24.0870
frequency: 8.0802 16.2074 24.0139 30.2452 32.3133 47.0884 57.2074 67.1382 72.8142 82.9183 94.4109 109.3256 121.8819 124.4362 126.0894 150.2037 173.3481 176.6728 195.8324 205.0503 225.5414 231.0433 234.5317 250.8097 259.4482 285.6510 290.3781 300.8531 315.1915 330.6591 340.1633 395.4439 402.3298 409.2827 417.9943 433.4957 437.5933 444.5727 455.8292 487.2752 500.4263 510.0498 527.3834 558.0938 562.0208 566.2393 570.5723 604.1217 615.5145 618.6909 651.6537 674.5853 684.8374 694.2106 707.9300 718.6786 737.4444 743.4335 748.0887 761.1887 767.3114 788.7156 795.1774 798.4287 826.5018 854.1574 869.4815 877.0383 887.1364 913.7770 917.3883 920.4958 935.8017 946.7752 949.5383 953.6244 981.8671 982.9295 986.2394 996.9773 1000.3024 1013.9848 1020.6511 1026.2720 1028.7856 1031.7167 1041.2860 1064.9409 1101.6061 1103.2466 1112.6098 1121.4990 1154.4661 1159.6291 1169.1873 1170.7674 1173.3211 1185.3297 1190.9528 1198.2697 1223.7120 1236.4717 1240.8424 1253.9343 1256.3343 1256.9349 1269.7951 1280.1322 1300.2313 1304.6190 1306.8138 1323.7998 1353.8433 1363.3146 1370.1268 1374.2471 1375.2090 1379.2062 1396.0278 1403.6756 1426.4172 1439.6092 1443.2379 1444.7091 1459.4534 1464.3067 1465.4056 1466.2677 1469.3754 1470.3896 1477.7796 1479.9723 1484.4646 1502.7369 1591.2837 1594.0878 1619.4315 1621.9672 1629.5383 1639.2611 1672.7503 2955.2702 2987.0499 2987.3009 2988.0868 2993.3716 3003.5907 3022.0038 3023.9537 3058.2591 3078.6497 3082.1021 3083.7775 3093.7179 3093.9194 3094.6660 3113.3735 3117.1416 3118.1547 3125.3258 3127.4117 3132.3112 3142.1275 3147.4790 3161.6564 3164.8136 3531.1281 3541.8014
redmass: 4.3340 4.1130 5.0973 5.4643 5.3814 4.7925 8.2709 7.0376 5.3604 4.6133 4.7426 5.5925 3.9907 5.0355 6.9114 4.0746 3.2681 1.2119 4.1940 4.6853 4.9701 1.2874 2.0209 1.0778 3.1859 4.2418 4.2252 3.0132 4.5524 2.6065 3.0147 3.6894 2.7601 6.4175 3.1021 2.8348 3.0146 2.9575 3.2802 3.1592 2.9661 4.7353 3.5463 3.8148 2.7440 4.6633 3.4815 1.8679 1.4765 5.4389 3.2162 4.2225 3.9827 6.2140 10.6192 4.9819 4.5218 1.6622 1.6023 2.5719 4.0417 2.3679 3.0984 3.5119 3.3482 3.0137 2.3074 1.4736 2.2756 1.5951 2.1393 2.3343 2.8738 1.4361 1.5667 1.2015 2.4599 1.4386 1.3263 6.2402 3.6383 2.6592 2.7214 2.4627 1.4242 1.4323 1.7865 2.7979 2.3605 1.8759 1.6819 2.4727 3.1657 1.3068 1.8682 1.2218 1.1791 1.6144 1.8340 1.3989 2.0204 1.1949 1.8232 1.8402 2.9724 1.4853 2.7270 1.3340 1.4305 1.8861 1.5644 2.2502 1.3102 1.3788 1.2312 1.3114 1.5129 7.8908 1.2189 3.8537 1.0941 2.2191 1.0714 2.4767 1.1193 1.0883 1.0623 1.0741 1.5449 1.4643 1.8506 1.0524 3.9740 1.0647 6.6527 6.9290 7.3535 7.0945 8.3860 8.7862 9.1788 1.0808 1.0360 1.0808 1.0354 1.0365 1.0622 1.0623 1.0575 1.0954 1.0995 1.0992 1.1036 1.1001 1.1079 1.0995 1.0999 1.0992 1.0872 1.0861 1.0879 1.0896 1.0940 1.0943 1.1001 1.0998 1.0641 1.0784
irintensity: 0.1129 0.6380 0.0329 0.1102 0.1099 1.0015 2.3501 0.0683 4.0059 1.0707 0.6886 3.7950 1.1554 3.3826 1.8432 2.0606 1.4906 0.8178 5.8945 0.8820 1.8345 0.6474 1.8562 0.1454 3.6778 1.7899 3.5869 4.7221 11.9020 6.8571 14.9397 2.5181 0.2271 0.3757 13.4887 2.2077 4.5603 0.2454 6.8359 5.0243 44.1260 1.0334 14.3471 0.8510 26.1284 11.6892 2.1723 15.2579 163.6335 0.4287 67.2684 15.2768 72.7437 12.6925 43.1307 0.1019 23.2502 0.1534 152.9677 31.4619 5.1320 0.9207 2.4706 8.3851 4.4482 16.1685 11.4163 0.8328 15.6643 0.7297 16.2299 19.3432 46.8466 0.4287 8.3636 0.2807 62.3233 8.7228 0.1956 3.7870 122.4686 10.5684 13.7439 16.2082 0.1531 8.5419 6.1859 67.3302 168.8046 10.8956 3.1949 217.3380 189.1372 2.5106 142.3273 24.0410 25.8372 6.8429 7.5535 1.9312 67.9409 22.2862 1.5689 2.3440 24.4851 3.5234 16.5130 9.2965 27.9794 1.0860 1.3521 57.6468 10.9540 8.0381 37.1325 53.8504 1.3122 9.4651 40.6956 0.6259 16.3332 26.1594 0.4782 9.7882 27.9197 43.0927 5.4865 26.6208 11.6625 4.3033 300.6224 3.9123 1.2051 56.9445 1.1271 0.3770 5.7313 0.6387 230.0102 125.3053 242.7735 8.3747 18.3112 15.7180 19.9501 27.1533 10.9692 14.4621 40.6394 7.3492 8.7009 16.7180 5.3349 61.6014 3.7989 53.0926 3.1569 14.3299 7.7560 3.9877 2.4276 2.8444 23.2697 23.2278 42.6155 23.2178 26.6190 127.8219
temp: 298.150 k
press: 1.00000 atm
elementType: 8 8 8 8 8 8 7 6 6 6 6 6 6 6 6 6 6 6 6 6 6 6 6 6 6 6 6 6 6 6 6 1 1 1 1 1 1 1 1 1 1 1 1 1 1 1 1 1 1 1 1 1 1 1 1 1 1 1
symmnumber: 1
zpe: 1218617.1 jmol-1
zpe.correction: 0.464147 hartree
zpe.thermalcorrener: 0.494310 hartree
zpe.thermalcorrenthalpy: 0.495254 hartree
zpe.thermalcorrgfe: 0.399704 hartree
zpe.sumelectzpe: -1434.628720 hartree
zpe.sumelectthermal: -1434.598557 hartree
zpe.sumelectthermalent: -1434.597612 hartree
zpe.sumelectthermalfe: -1434.693163 hartree
dipole: -2.7829 -2.6147 1.2547
dipole: 4.0194
quadrupole: -176.7839 -178.6301 -177.4860
quadrupole: -15.5022 11.6199 5.7358
quadrupole: 0.8494 -0.9968 0.1474 -15.5022 11.6199 5.7358
hfenergy: -1435.0928669 hartree
pointgroup: C01 [X(C24H27N1O6)]
dipole: 1.1592043 1.0549127 0.2099112 debye
polarizability: 303.7994774|-14.2763145|291.003256|-55.4216477|-25.2732415|244.8312994 unknown
InChI: InChI=1S/C24H27NO6/c1-24(2,3)31-23(29)25-20(22(27)28)12-13-21(26)30-14-19-17-10-6-4-8-15(17)16-9-5-7-11-18(16)19/h4-11,19-20,25,27H,12-14H2,1-3H3
charge 0 multiplicity 1
58 atoms
O  1.648593 -2.07042 -0.824645
O  -2.954821 1.651962 0.043267
O  0.086381 -2.995039 0.646637
O  -2.264994 -2.163264 2.334433
O  -2.795319 -4.118228 1.198877
O  -4.06706 0.142127 -1.421678
N  -2.601298 -0.579081 0.248702
C  3.230826 -0.920198 0.710618
C  3.890789 -0.011808 -0.330097
C  2.12228 -0.024583 1.273236
C  3.250878 1.262467 -0.35017
C  2.154507 1.253336 0.637791
C  2.737061 -2.279509 0.167434
C  4.975627 -0.2813 -1.18038
C  1.152814 -0.31449 2.247644
C  3.700051 2.275586 -1.224979
C  1.21607 2.249373 0.984953
C  5.425608 0.734335 -2.061858
C  0.206392 0.684567 2.592224
C  4.792118 2.001869 -2.081561
C  0.240612 1.955542 1.966305
C  -2.07577 -2.534252 -1.294821
C  -0.647764 -1.993704 -1.492273
C  -2.842028 -1.995291 -0.036271
C  0.350536 -2.420473 -0.435417
C  -3.545709 2.901876 -0.59396
C  -3.103868 2.987462 -2.068898
C  -2.906088 4.018534 0.249805
C  -5.079483 2.88094 -0.435649
C  -2.615652 -2.88437 1.185662
C  -3.279058 0.387801 -0.463806
H  3.965449 -1.166427 1.508454
H  2.357757 -2.923971 0.980087
H  3.538824 -2.798646 -0.383675
H  5.475342 -1.25747 -1.170432
H  1.105565 -1.301795 2.719262
H  3.215903 3.258449 -1.245308
H  1.23411 3.232614 0.501163
H  6.270141 0.539641 -2.732163
H  -0.559322 0.470128 3.346084
H  5.153475 2.775947 -2.767828
H  -0.506529 2.709845 2.235383
H  -2.664417 -2.232268 -2.178847
H  -2.079301 -3.637719 -1.244757
H  -0.257556 -2.302986 -2.479321
H  -0.655798 -0.886466 -1.507237
H  -3.917956 -2.106563 -0.282385
H  -2.015637 -0.309368 1.042623
H  -2.003177 2.929617 -2.144565
H  -3.548894 2.172202 -2.660436
H  -3.429251 3.954516 -2.494437
H  -1.806003 3.985001 0.162228
H  -3.178543 3.904632 1.313487
H  -3.259333 5.004694 -0.100849
H  -5.521257 2.054162 -1.013613
H  -5.501862 3.835697 -0.799632
H  -5.35563 2.765078 0.627613
H  -2.096627 -2.807511 3.072972
