program: Gaussian 09
title: 000129795
version: EM64L-G09RevD.01
frameworkgroup: C1[X(C9H16N2O5)]
method: RPBEPBE
basis: SDD
operation: Freq
keyword: #p
keyword: freq=noraman
keyword: PBEPBE/SDD
title: #p freq=noraman PBEPBE/SDD
converged: YES YES NO NO
title: Mulliken charges:
elementType: O O O O O N N C C C C C C C C C H H H H H H H H H H H H H H H H
charge: -0.270790 -0.398392 -0.239343 -0.417706 -0.224735 -0.428276 -0.573166 -0.138091 -0.389964 -0.527252 -0.485368 -0.354161 0.237790 0.116591 -0.371164 0.181703 0.308389 0.282529 0.252467 0.337286 0.225830 0.209246 0.257706 0.267612 0.230856 0.223019 0.175978 0.203004 0.274421 0.264568 0.390350 0.379064
chargesum: 0.00000
title: Mulliken charges with hydrogens summed into heavy atoms:
elementType: O O O O O N N C C C C C C C C C
charge: -0.270790 -0.008042 -0.239343 -0.038642 -0.224735 -0.090989 -0.034177 0.170298 0.145032 -0.092176 0.039950 0.099714 0.237790 0.116591 0.007818 0.181703
polarizability: 1.45831464e+02 6.81352767e+00 1.17561816e+02 -3.60911931e+00 5.89775074e+00 1.16654047e+02
1716.lowfreq: -10.9158 -5.0211 -0.0007 0.0004 0.0007 2.4637 11.9962 13.5457 35.5727
frequency: 11.3545 13.4361 35.5420 40.4143 54.8560 69.2815 76.6171 92.4962 108.9280 115.4565 145.6045 170.2611 204.4692 218.0505 242.3213 278.9160 307.7111 330.2516 413.2719 428.3494 469.7730 502.6619 506.9913 559.3220 585.4664 592.3581 609.0272 627.6763 638.9161 643.2724 709.4677 728.1112 760.5571 772.2714 839.5580 857.4137 887.8682 914.2631 962.1108 965.5354 1024.8878 1042.1065 1055.9021 1059.7234 1071.5665 1097.1953 1103.5782 1117.4008 1145.8537 1180.5361 1211.9610 1217.5689 1223.2348 1246.2762 1270.5101 1281.6066 1283.3086 1288.7685 1294.0306 1333.6506 1340.1168 1359.9845 1380.0404 1388.0541 1440.2194 1448.6771 1467.7108 1473.1517 1475.8911 1493.3695 1603.9388 1639.5584 1647.9102 1670.4887 2855.9210 2974.9827 2990.7297 2994.6277 3004.8735 3006.1918 3028.6806 3035.5733 3042.5543 3066.7993 3100.7979 3458.0066 3513.3698 3513.9120 3518.6863 3586.3208
redmass: 5.7860 9.3171 4.9576 6.9000 8.6706 2.5753 3.1271 2.7064 3.6897 2.6549 4.0748 4.4909 3.4573 5.0981 1.2308 4.7656 3.6384 4.2169 4.0231 4.6400 3.3580 2.3958 2.2292 2.9459 4.3241 1.4419 1.4619 1.5888 1.3307 1.8303 4.6325 4.5901 1.1507 1.5784 3.0214 1.3897 4.4180 3.7764 2.2979 2.4349 2.7796 3.0606 2.6453 2.0910 2.1464 2.5293 2.0549 1.8052 2.1137 1.2990 1.5284 1.4572 1.3911 1.4682 1.4543 1.1941 1.1890 1.1683 1.3709 1.4604 1.6160 2.1271 1.7796 1.4685 1.0983 1.1054 1.1447 1.0818 1.9869 1.0909 7.1105 1.0949 8.2492 8.2683 1.0716 1.0588 1.0616 1.0648 1.0818 1.0816 1.1010 1.0622 1.0965 1.1045 1.1039 1.0449 1.0776 1.0641 1.0644 1.0977
irintensity: 0.2940 1.3413 0.3299 3.3522 0.5641 3.1421 3.0857 0.7234 2.3422 2.8316 8.2755 16.4941 0.8194 1.3224 44.6612 1.3991 10.2922 6.1012 22.2436 41.7153 4.1262 74.6759 3.7427 105.4003 5.3046 181.4618 48.1088 15.8344 135.1477 169.2581 1.1015 15.4084 15.8660 32.7798 4.2042 2.7257 3.6353 17.6114 7.2530 13.6056 135.3693 115.7541 83.1989 112.6222 53.1985 34.5227 36.8188 1.6807 8.1030 2.4914 19.1356 21.7690 9.6102 1.0730 11.2352 14.2273 3.8674 7.0904 2.6179 47.0102 33.6685 113.8978 56.0074 16.7541 28.6338 11.5949 44.6216 9.7460 270.4797 6.6775 191.1974 38.9010 146.9267 218.8682 120.5186 15.4618 9.5202 14.3082 46.5700 14.8644 4.7583 7.5527 5.6510 55.2437 8.0520 0.9523 67.0609 23.8986 31.1947 0.4492
temp: 298.150 k
press: 1.00000 atm
elementType: 8 8 8 8 8 7 7 6 6 6 6 6 6 6 6 6 1 1 1 1 1 1 1 1 1 1 1 1 1 1 1 1
symmnumber: 1
zpe: 673264.4 jmol-1
zpe.correction: 0.256433 hartree
zpe.thermalcorrener: 0.275023 hartree
zpe.thermalcorrenthalpy: 0.275967 hartree
zpe.thermalcorrgfe: 0.204736 hartree
zpe.sumelectzpe: -836.940398 hartree
zpe.sumelectthermal: -836.921807 hartree
zpe.sumelectthermalent: -836.920863 hartree
zpe.sumelectthermalfe: -836.992095 hartree
dipole: 0.0046 -1.6625 -2.8951
dipole: 3.3385
quadrupole: -72.4389 -91.6208 -107.8419
quadrupole: 2.6072 2.6411 -3.5311
quadrupole: 18.1949 -0.9869 -17.2080 2.6072 2.6411 -3.5311
hfenergy: -837.1968304 hartree
pointgroup: C01 [X(C9H16N2O5)]
dipole: -0.0133202 0.5267958 -1.2031155 debye
polarizability: 143.9309659|10.0350686|117.9537311|4.2720512|-5.2302536|118.1626301 unknown
InChI: InChI=1S/C9H16N2O5/c10-5-1-2-7(12)11-6(9(15)16)3-4-8(13)14/h6,11,13,15H,1-5,10H2
charge 0 multiplicity 1
32 atoms
O  -1.436463 0.718061 1.659842
O  3.013637 2.631686 0.039757
O  1.600693 2.42824 -1.791875
O  2.912318 -3.028794 -0.822307
O  2.940772 -2.427391 1.420594
N  -0.30686 1.143751 -0.318348
N  -5.519828 -1.998155 -0.377612
C  0.964669 1.403866 0.368042
C  1.675714 0.108255 0.868417
C  -2.730399 0.668834 -0.433387
C  1.99732 -0.875272 -0.269316
C  -3.467352 -0.64534 -0.081222
C  -1.455862 0.840002 0.394868
C  1.850442 2.196498 -0.585672
C  -4.866641 -0.72187 -0.724666
C  2.649345 -2.146173 0.238588
H  0.766366 2.020347 1.266784
H  1.004351 -0.363946 1.605045
H  2.597759 0.397393 1.401536
H  -0.336554 1.317994 -1.327449
H  -3.394308 1.525244 -0.197517
H  -2.512574 0.713788 -1.518242
H  2.675928 -0.432597 -1.025271
H  1.079366 -1.159226 -0.818647
H  -3.553998 -0.706794 1.021016
H  -2.879762 -1.52282 -0.409748
H  -5.44582 0.186499 -0.418984
H  -4.766917 -0.678642 -1.827211
H  -6.376956 -2.198542 -0.900924
H  -5.642064 -2.140231 0.630199
H  3.576622 3.137876 -0.606695
H  3.337557 -3.854141 -0.462194
