program: Gaussian 09
title: 000129801
version: EM64L-G09RevD.01
frameworkgroup: C1[X(C13H11ClFN5)]
method: RPBEPBE
basis: SDD
operation: Freq
keyword: #p
keyword: freq=noraman
keyword: PBEPBE/SDD
title: #p freq=noraman PBEPBE/SDD
converged: YES YES NO NO
title: Mulliken charges:
elementType: Cl F N N N N N C C C C C C C C C C C C C H H H H H H H H H H H
charge: -0.046647 -0.178101 -0.165798 -0.089791 -0.046854 -0.362314 -0.066279 -0.513384 0.165214 -0.101241 0.376372 -0.216943 0.185977 -0.257079 0.221613 -0.240201 -0.378028 -0.378874 -0.182424 -0.601864 0.279307 0.264436 0.276445 0.335476 0.263133 0.265191 0.240931 0.244873 0.249279 0.249653 0.207924
chargesum: 0.00000
title: Mulliken charges with hydrogens summed into heavy atoms:
elementType: Cl F N N N N N C C C C C C C C C C C C C
charge: -0.046647 -0.178101 -0.165798 -0.089791 -0.046854 -0.026838 -0.066279 0.030359 0.165214 -0.101241 0.376372 0.059502 0.185977 -0.257079 0.221613 0.022931 -0.112837 -0.137943 0.062450 0.104992
polarizability: 2.55918963e+02 1.46291896e+01 1.66429371e+02 6.56887992e+00 7.00799449e+00 1.31732167e+02
1716.lowfreq: -18.7931 -5.9342 -2.6054 0.0004 0.0012 0.0015 6.2760 13.8779 21.0528
frequency: -17.7861 13.6369 21.0067 40.7352 74.4739 99.6856 116.1392 153.3941 178.5200 185.7156 212.9436 249.7859 259.7022 287.8674 309.2313 318.5886 358.4249 380.2064 452.3411 495.4081 497.5950 514.6827 533.3881 549.9132 554.6480 573.9722 623.3566 642.2504 648.1103 667.1181 698.6891 717.7819 766.3995 788.9359 791.0112 801.4705 818.4137 838.5929 850.3225 886.9018 928.4835 954.8540 957.9065 968.1794 1057.5129 1072.7117 1086.6405 1117.6922 1123.8273 1143.5227 1167.0321 1176.7018 1202.9983 1211.1076 1227.0966 1246.7114 1298.9113 1302.5523 1313.4135 1363.5695 1371.7640 1379.3624 1383.4623 1420.5683 1427.1237 1433.7345 1447.9905 1453.1014 1455.3448 1471.4188 1485.1974 1504.5118 1546.3183 1577.2969 1610.2936 1618.5210 2988.7066 3025.1423 3067.9351 3084.7251 3107.7821 3157.4077 3161.6813 3179.2478 3189.7512 3234.5663 3571.0723
redmass: 1.0519 7.2456 6.6551 5.2945 5.5645 8.0014 7.3764 4.3284 4.4260 7.1796 4.8361 8.8765 6.3751 5.7207 3.6424 4.4179 3.8659 9.2784 4.8810 4.6240 7.7913 5.5920 1.2071 4.5948 3.3898 6.5160 5.2343 5.2868 5.4391 8.2500 4.9377 5.1108 2.0308 2.6457 3.8849 4.1185 1.9494 6.2127 7.3718 1.3828 1.4339 5.5383 2.1798 1.3260 2.0488 2.1144 4.7956 3.6161 1.2829 2.8244 1.5074 1.9878 1.8245 2.0946 2.5736 2.0644 5.3644 2.3357 3.9876 5.6721 1.5339 2.0874 2.7384 1.9459 1.8673 2.3544 3.0733 1.5342 1.0453 1.3263 1.4435 1.7917 6.7591 6.8198 8.7047 6.2372 1.0340 1.0592 1.1011 1.1044 1.1012 1.0880 1.0919 1.0931 1.0994 1.0985 1.0779
irintensity: 0.0594 0.2981 0.2994 1.9985 3.2170 2.1263 1.8860 1.5336 2.8418 0.4236 1.3581 3.8191 1.5713 1.6604 3.1644 2.9321 2.2151 7.8186 8.3779 1.9987 3.7628 4.7268 96.6633 2.8163 7.1946 2.8649 8.3786 23.9000 21.1566 1.8951 27.1803 1.0913 12.8091 46.4138 30.5614 46.2284 3.5273 11.9703 20.3245 0.4921 11.3824 13.4058 40.8998 1.7089 1.3473 7.8670 8.5002 21.8179 1.5685 2.0756 5.9485 5.7962 41.6639 43.6239 15.9012 7.5382 114.7522 12.7124 78.5010 65.3834 16.5781 2.0262 1.5394 85.6124 4.8489 58.3261 20.1138 13.9247 14.3384 19.4464 28.8741 10.0551 66.9993 54.4026 46.3810 628.8600 78.6875 18.4877 28.8015 6.3616 23.6174 4.5696 20.1054 1.2218 3.4194 0.2746 66.7545
temp: 298.150 k
press: 1.00000 atm
elementType: 17 9 7 7 7 7 7 6 6 6 6 6 6 6 6 6 6 6 6 6 1 1 1 1 1 1 1 1 1 1 1
symmnumber: 1
zpe: 593627.8 jmol-1
zpe.correction: 0.226101 hartree
zpe.thermalcorrener: 0.242661 hartree
zpe.thermalcorrenthalpy: 0.243606 hartree
zpe.thermalcorrgfe: 0.179008 hartree
zpe.sumelectzpe: -1334.238867 hartree
zpe.sumelectthermal: -1334.222306 hartree
zpe.sumelectthermalent: -1334.221362 hartree
zpe.sumelectthermalfe: -1334.285960 hartree
dipole: -2.9567 -0.5941 -2.2814
dipole: 3.7815
quadrupole: -97.8686 -124.1724 -119.9590
quadrupole: -9.5787 -0.8394 -3.6942
quadrupole: 16.1314 -10.1724 -5.9590 -9.5787 -0.8394 -3.6942
hfenergy: -1334.4649676 hartree
pointgroup: C01 [X(C13H11Cl1F1N5)]
dipole: -1.1448452 0.4622887 0.8300808 debye
polarizability: 252.5465391|-23.156016|171.1993526|-1.5193101|1.741237|130.3346088 unknown
InChI: InChI=1S/C13H11ClFN5/c1-16-12-11-13(18-6-17-12)20(7-19-11)5-8-9(14)3-2-4-10(8)15/h2-4,6-7,16H,5H2,1H3
charge 0 multiplicity 1
31 atoms
Cl -3.330191 2.526745 -1.13594
F  -1.542442 -2.17391 0.26352
N  0.039289 0.53071 -0.600738
N  1.529787 1.667619 0.725123
N  1.514388 -1.312477 -1.380369
N  4.430008 0.619897 1.022505
N  3.784657 -1.1341 -0.442057
C  -1.200126 0.15662 -1.312678
C  1.244748 -0.179515 -0.66936
C  2.148242 0.537904 0.155515
C  -2.387558 -0.009687 -0.378803
C  0.27115 1.627275 0.24526
C  3.473824 0.011733 0.255499
C  -3.41344 0.950791 -0.209106
C  -2.533443 -1.18629 0.394911
C  -4.509201 0.763816 0.65648
C  -3.597891 -1.428004 1.275388
C  2.807195 -1.717668 -1.205333
C  -4.594517 -0.434966 1.399648
C  5.799593 0.1101 1.144858
H  -0.971161 -0.797006 -1.820337
H  -1.428633 0.918193 -2.076948
H  -0.505615 2.353518 0.473887
H  4.147594 1.466441 1.517941
H  -5.275297 1.53776 0.74822
H  -3.638137 -2.364224 1.838029
H  3.105493 -2.623502 -1.741894
H  -5.439508 -0.592039 2.076758
H  6.297963 0.072287 0.159707
H  5.805644 -0.914574 1.557434
H  6.368783 0.775054 1.814883
