program: Gaussian 09
title: 000129775
version: EM64L-G09RevD.01
frameworkgroup: C1[X(C16H12O3)]
method: RPBEPBE
basis: SDD
operation: Freq
keyword: #pfreq=noraman
keyword: PBEPBE/SDD
title: #p freq=noraman PBEPBE/SDD
converged: YES YES NO NO
title: Mulliken charges:
elementType: O O O C C C C C C C C C C C C C C C C H H H H H H H H H H H H
charge: -0.263767 -0.293777 -0.213335 0.449088 0.252932 0.203645 0.087403 -0.468549 0.207155 0.064127 -0.411366 -0.349378 -0.372456 -0.222605 -0.234579 -0.359263 -0.253013 -0.208848 -0.517318 0.257363 0.240024 0.273723 0.249149 0.233885 0.244395 0.237674 0.232134 0.231577 0.264404 0.207387 0.232187
chargesum: 0.00000
title: Mulliken charges with hydrogens summed into heavy atoms:
elementType: O O O C C C C C C C C C C C C C C C C
charge: -0.263767 -0.293777 -0.213335 0.449088 0.252932 0.203645 0.087403 -0.211186 0.207155 0.064127 -0.171342 -0.075655 -0.123307 0.011280 0.003096 -0.114868 -0.020879 0.022729 0.186661
polarizability: 3.08933132e+02 -3.33044224e+00 1.93811465e+02 -7.68691310e+00 -2.33431259e+00 9.03783073e+01
1716.lowfreq: -6.8509 -0.0001 0.0007 0.0008 2.9988 5.8905 33.9886 49.3733 68.6127
frequency: 33.9511 49.3594 68.6045 85.8630 110.9773 133.3240 147.1714 167.4924 200.4621 225.9230 239.1763 292.0617 296.2305 333.7154 420.7082 432.1657 446.6585 472.8774 484.9835 518.4358 533.1037 565.7697 579.1749 597.6797 646.6139 653.9062 664.3454 707.7306 751.9287 759.6488 767.7946 773.8047 784.2293 843.3261 853.7160 870.2368 895.0276 899.9342 927.5992 946.5638 958.6341 979.0735 983.7412 999.1551 1003.3389 1033.1925 1039.6609 1101.4348 1108.5639 1110.7911 1149.6920 1170.0222 1173.9652 1198.3477 1203.7718 1216.1885 1248.6132 1264.6606 1306.7617 1326.0792 1369.4853 1399.0721 1422.8928 1435.7465 1445.0629 1455.7457 1473.2718 1475.3379 1483.1002 1561.3890 1574.3212 1601.7039 1613.4472 1626.1001 1668.6479 2967.8471 3071.3179 3125.1929 3129.9320 3131.2488 3139.4389 3144.3273 3153.7762 3156.3130 3169.1230 3171.2774 3172.0614
redmass: 5.6092 4.7396 5.0239 2.9472 4.6521 2.4187 1.4109 4.3915 6.9920 6.6677 4.5840 6.2096 5.5520 4.2482 4.0255 3.9968 5.9127 5.9575 5.8964 7.2986 3.6921 4.1881 5.7480 5.9522 5.5676 5.2423 4.6821 6.4456 4.7196 1.9456 2.0036 1.9037 2.0947 5.0204 1.3378 1.6295 4.0738 1.7370 8.3518 1.6744 4.2759 1.3853 1.3296 5.5718 1.3435 2.1595 2.0131 1.9372 1.8869 1.3224 1.3384 1.0799 1.1112 1.7858 2.5841 2.5641 1.7084 1.6617 2.1688 2.3071 8.1923 8.5029 1.5048 2.0460 1.8925 1.0641 2.4697 1.0581 2.9564 7.0981 6.6273 6.4407 6.8083 7.6499 11.8231 1.0326 1.1018 1.1024 1.0865 1.0852 1.0898 1.0901 1.0946 1.0947 1.1007 1.0939 1.0990
irintensity: 3.6447 0.2337 0.9958 12.4771 0.8642 1.5218 0.6112 1.4512 1.6669 1.5468 1.3001 4.5542 4.7952 4.6491 3.6106 1.2373 0.5224 7.7598 7.6649 1.2216 8.1578 4.3631 5.6887 4.1127 3.1949 2.5265 23.8602 11.1201 0.8949 16.6663 46.2369 61.1579 19.9503 3.5314 30.3628 6.5809 17.5595 12.1716 99.9397 3.3187 37.9491 3.6218 0.0316 45.9966 0.0935 0.7454 3.9917 39.0462 16.0978 4.4923 0.7429 4.0500 1.4718 16.6812 60.4475 29.4507 4.6757 13.1781 19.5183 4.8534 1.0509 27.4013 26.2623 3.9934 13.8336 15.8161 19.2158 8.1413 84.7160 34.7586 9.5448 6.7829 33.3148 185.9165 350.9115 69.8751 27.1456 22.1861 2.9482 0.4644 8.0882 9.6633 20.4914 12.2535 21.7094 23.8558 12.2725
temp: 298.150 k
press: 1.00000 atm
elementType: 8 8 8 6 6 6 6 6 6 6 6 6 6 6 6 6 6 6 6 1 1 1 1 1 1 1 1 1 1 1 1
symmnumber: 1
zpe: 615449.6 jmol-1
zpe.correction: 0.234412 hartree
zpe.thermalcorrener: 0.250121 hartree
zpe.thermalcorrenthalpy: 0.251066 hartree
zpe.thermalcorrgfe: 0.190597 hartree
zpe.sumelectzpe: -841.251414 hartree
zpe.sumelectthermal: -841.235705 hartree
zpe.sumelectthermalent: -841.234761 hartree
zpe.sumelectthermalfe: -841.295230 hartree
dipole: 0.3035 -3.5936 0.2481
dipole: 3.6149
quadrupole: -82.4880 -103.4514 -116.5090
quadrupole: 7.2917 -4.6035 2.9318
quadrupole: 18.3281 -2.6353 -15.6928 7.2917 -4.6035 2.9318
hfenergy: -841.4858263 hartree
pointgroup: C01 [X(C16H12O3)]
dipole: -0.2027343 -1.3657109 0.3412155 debye
polarizability: 308.7849146|-6.1171866|185.6687753|-7.8851564|-27.9842696|98.6692145 unknown
InChI: InChI=1S/C16H12O3/c1-18-14-9-5-4-8-13(14)15-10-11-6-2-3-7-12(11)16(17)19-15/h2-10H,1H3
charge 0 multiplicity 1
31 atoms
O  0.08667 1.073403 0.039119
O  -2.148238 1.204793 -1.683092
O  1.714885 2.68789 -0.049262
C  2.014162 -1.005481 -0.058653
C  -0.327336 -0.271345 0.016912
C  -1.794126 -0.427317 0.101688
C  2.452282 0.36054 -0.06721
C  0.594634 -1.290722 -0.025092
C  -2.678779 0.376735 -0.676915
C  1.476828 1.463603 -0.03532
C  2.998925 -2.03548 -0.095538
C  3.836826 0.673128 -0.109054
C  -2.352589 -1.387243 0.989457
C  4.365939 -1.71491 -0.135145
C  4.791245 -0.357274 -0.141602
C  -4.079257 0.244492 -0.53032
C  -3.748493 -1.528557 1.124412
C  -4.614227 -0.701561 0.369563
C  -2.244326 2.661723 -1.453752
H  0.241304 -2.323904 -0.067225
H  2.676883 -3.083023 -0.093452
H  4.132121 1.727311 -0.115447
H  -1.679382 -1.996876 1.602337
H  5.11214 -2.516632 -0.162753
H  -4.736907 0.858161 -1.155429
H  5.85925 -0.11877 -0.17358
H  -4.158745 -2.26624 1.821688
H  -5.700273 -0.803152 0.471426
H  -1.559787 2.953339 -0.637747
H  -3.283418 2.962663 -1.215823
H  -1.926911 3.128406 -2.398193
