program: Gaussian 09
title: 000129767
version: EM64L-G09RevD.01
frameworkgroup: C1[X(C11H10N4O)]
method: RPBEPBE
basis: SDD
operation: Freq
keyword: #p
keyword: freq=noraman
keyword: PBEPBE/SDD
title: #p freq=noraman PBEPBE/SDD
converged: NO YES NO YES
title: Mulliken charges:
elementType: O N N N N C C C C C C C C C C C H H H H H H H H H H
charge: -0.427739 -0.235432 -0.073221 -0.105996 -0.631487 0.413311 -0.222815 0.516653 -0.191716 -0.545761 0.117600 0.193497 -0.664575 -0.348980 -0.187426 -0.378210 0.246889 0.240942 0.257559 0.240813 0.276485 0.226345 0.339386 0.328766 0.241716 0.373395
chargesum: 0.00000
title: Mulliken charges with hydrogens summed into heavy atoms:
elementType: O N N N N C C C C C C C C C C C
charge: -0.054345 -0.235432 -0.073221 -0.105996 0.036666 0.413311 -0.222815 0.516653 -0.191716 -0.298872 0.117600 0.193497 0.074739 -0.072494 0.038919 -0.136493
polarizability: 2.52726818e+02 -6.60789146e+00 1.65666325e+02 -1.33470861e-02 -9.62702928e-04 6.32464240e+01
1716.lowfreq: -101.1182 -5.7808 -0.0006 -0.0004 0.0002 2.5874 6.8739 70.5084 99.9630
frequency: -101.1044 70.5062 99.9620 105.1637 159.0459 181.4493 192.6727 244.5876 249.9170 275.3662 314.3896 352.4015 383.5079 410.8933 422.4103 432.6264 493.4227 524.8233 535.8029 619.9464 625.1273 629.3985 668.9324 682.6602 703.5316 734.1968 757.4981 795.5277 798.2653 826.2954 854.1249 854.8433 936.2409 976.1195 991.2246 1019.7494 1029.2603 1067.3117 1098.9286 1119.7171 1142.4809 1173.7280 1191.5161 1238.0256 1246.0281 1290.4180 1334.8266 1357.6651 1389.1690 1397.0079 1414.3182 1424.0934 1468.3551 1475.8356 1477.1344 1487.4327 1521.2930 1562.7958 1572.6469 1593.2724 1625.3467 1649.1405 2971.3073 3045.9453 3112.3659 3131.3475 3151.1882 3164.9264 3172.1261 3273.0563 3581.9016 3728.7727
redmass: 1.1313 1.8219 5.3667 1.7188 5.1143 4.3377 3.6520 4.5327 3.8663 3.2420 4.7480 5.0638 4.2613 7.3846 3.5138 1.2932 6.4329 4.3780 5.5762 3.3508 4.4902 5.2011 5.8514 9.4848 1.3629 3.1858 6.6299 1.6643 6.3103 1.6682 2.6411 4.1233 1.4336 3.2364 1.3671 2.4722 2.6188 3.4282 2.8640 1.3090 1.3753 1.6553 1.8566 3.4646 2.3125 2.9734 3.5996 3.0111 2.4148 2.5766 2.0063 4.8849 2.0004 2.2387 1.0408 1.5532 5.0597 2.1057 5.6351 5.4904 2.4941 4.4661 1.0370 1.1023 1.0962 1.0885 1.0904 1.0920 1.0997 1.0630 1.0449 1.1049
irintensity: 55.3644 1.3262 1.2432 65.8727 9.0599 4.7889 16.9192 13.6743 6.1727 9.6801 10.4708 1.3111 37.4955 0.9870 0.1050 133.8317 0.1134 0.0151 0.5681 1.2694 0.2473 30.4934 9.3163 3.6274 108.4714 20.9280 7.2942 68.6092 23.1826 0.0230 29.8088 0.4959 0.0891 46.3329 0.9486 2.9249 9.8541 21.0082 15.4346 0.4417 14.8083 52.3679 65.3398 51.9063 22.2124 13.3353 39.8441 108.1802 110.5551 75.8036 12.9634 111.6472 92.5693 19.9625 14.4699 18.7747 0.0533 129.7051 1.7392 75.2569 185.5894 392.9557 77.3125 27.6452 6.9203 15.8414 11.6775 7.1713 24.4188 106.3846 133.2584 41.5234
temp: 298.150 k
press: 1.00000 atm
elementType: 8 7 7 7 7 6 6 6 6 6 6 6 6 6 6 6 1 1 1 1 1 1 1 1 1 1
symmnumber: 1
zpe: 518002.9 jmol-1
zpe.correction: 0.197297 hartree
zpe.thermalcorrener: 0.209994 hartree
zpe.thermalcorrenthalpy: 0.210938 hartree
zpe.thermalcorrgfe: 0.158586 hartree
zpe.sumelectzpe: -718.306800 hartree
zpe.sumelectthermal: -718.294103 hartree
zpe.sumelectthermalent: -718.293159 hartree
zpe.sumelectthermalfe: -718.345511 hartree
dipole: -5.4882 -0.9554 0.0007
dipole: 5.5707
quadrupole: -58.8767 -92.5101 -97.4589
quadrupole: -9.6967 -0.0031 -0.0004
quadrupole: 24.0719 -9.5616 -14.5103 -9.6967 -0.0031 -0.0004
hfenergy: -718.5040973 hartree
pointgroup: C01 [X(C11H10N4O1)]
dipole: -2.156183 -0.3928769 0.0002814 debye
dipolederiv: -0.7939926 -0.5532271 0.0000539 -0.6664095 -1.0014389 0.0000426 0.0000306 0.000021 -0.387584 -0.9283031 0.1806209 0.0001585 -0.0165648 -0.5313152 -0.0001228 -0.0002978 0.0002097 -0.1428917 -1.2967547 -0.2390434 0.0001237 0.0965859 -0.4369063 0.00003 0.0001624 0.0000343 -0.2840779 -0.3728441 -0.1290526 0.000015 0.0342834 -0.4167784 0.0000052 0.0000213 0.0000027 -0.222179 -1.6792375 -0.5478644 -0.000048 -0.6268883 -0.4361837 0.0001459 -0.0001981 0.0001139 -0.7418058 0.8757292 0.0305563 -0.0000585 -0.347432 -0.0884293 0.0000751 0.0000099 -0.0000503 0.0605598 0.1338911 0.395227 -0.0000701 0.8320503 0.1192747 -0.0001106 -0.0000713 -0.0000316 -0.0698845 0.4791752 -0.3449064 0.0000031 0.3307398 -0.2365231 -0.0000001 -0.0000402 0.0000384 0.1040045 -0.0180698 0.2457967 -0.0000116 -0.8752984 -0.0640197 0.000042 0.0000286 -0.0000103 -0.017089 -0.1297825 -0.2001576 -0.0000198 0.1297084 0.026706 0.0000319 -0.0000692 -0.0000036 -0.2356764 1.9463557 0.5523282 -0.0001731 0.2214808 0.7793053 -0.0000559 -0.0000887 -0.0000946 0.1981262 0.4072952 0.5305538 -0.0000329 0.8301851 0.8617395 -0.0000626 -0.0000332 0.0000017 0.0617557 0.4755666 -0.2442538 -0.000172 -0.3105864 0.2288584 0.0003787 -0.0001548 0.0002664 0.2571525 0.1214428 0.0630797 -0.0000216 -0.0532973 0.1307624 -0.0000084 -0.0000083 -0.0000114 -0.1158154 -0.2390039 -0.0784921 0.0000116 -0.0763413 0.0228947 -0.0000016 0.0000089 -0.0000005 -0.1406608 0.3076909 0.0375659 -0.0000263 0.1263552 0.1298033 -0.000024 -0.0000344 -0.0000173 -0.0850208 0.055 0.0840565 0.0000113 0.0605586 -0.0416719 -0.0000167 0.0000637 -0.0000077 0.1872077 -0.0912474 0.0770082 0.0897723 0.0148802 0.0719166 0.0530283 0.1409496 -0.011873 -0.0590408 0.0859205 -0.1169698 0.000366 -0.0058722 -0.0523869 0.0003279 0.0002043 0.0003038 0.1243333 -0.0917287 0.0766576 -0.0899976 0.013807 0.0720962 -0.0536613 -0.1406566 0.011145 -0.0582448 0.0803826 -0.0834899 0.0000084 -0.0341434 -0.0002692 0.00001 0.0000043 0.0000116 0.145776 0.0201018 0.0956398 0.0000046 0.1191129 -0.0648968 0.0000032 0.0000055 0.0000048 0.1649306 0.2053991 0.0469015 0.0000533 0.1150055 0.2317062 -0.0000183 0.0000312 0.0000061 0.3951793 0.2527169 0.048247 0.0000464 0.0032035 0.1508 -0.0000475 0.0001344 -0.0000626 0.383311 -0.1531793 0.0242551 0.0000177 0.0049108 0.0776565 0.0000026 0.0000159 0.0000002 0.1383435 0.3474761 0.048963 -0.0000143 0.0799661 0.4672997 0.0000063 -0.0000181 0.0000034 0.3392906 unknown
polarizability: 252.8254023|-5.9221371|165.567741|-0.0133391|-0.0010677|63.246424 unknown
InChI: InChI=1S/C11H10N4O/c1-15-7-5-8(16)10-6(3-2-4-13-10)9(7)14-11(15)12/h2-5,16H,12H2,1H3
charge 0 multiplicity 1
26 atoms
O  1.840129 2.859942 -0.000095
N  -2.545908 0.473359 0.000131
N  -1.578958 -1.61502 0.000262
N  3.008906 0.462416 -0.00013
N  -3.99369 -1.488104 0.000415
C  -1.149785 0.686514 0.000089
C  -0.576922 -0.619827 0.00014
C  0.842093 -0.763956 0.000067
C  1.625265 0.450058 -0.000038
C  -0.393876 1.888928 0.000021
C  -2.733513 -0.92259 0.000286
C  0.997044 1.753556 -0.000053
C  -3.599295 1.486462 0.000027
C  1.561682 -1.998562 0.000085
C  2.961815 -1.977192 -0.000004
C  3.651573 -0.722911 -0.000112
H  -0.84106 2.886903 0.00009
H  -4.234207 1.407998 0.903158
H  -3.14184 2.487399 -0.002348
H  -4.23665 1.404984 -0.901109
H  1.001132 -2.938636 0.000168
H  3.540227 -2.906245 0.000005
H  -4.049348 -2.50196 0.000413
H  -4.843341 -0.934642 0.000784
H  4.746762 -0.689004 -0.000181
H  2.770164 2.47013 -0.00007
