program: Gaussian 09
title: 000129748
version: EM64L-G09RevD.01
frameworkgroup: C1[X(C16H13NO2S)]
method: RPBEPBE
basis: SDD
operation: Freq
keyword: #p
keyword: freq=noraman
keyword: PBEPBE/SDD
title: #p freq=noraman PBEPBE/SDD
converged: YES YES NO NO
title: Mulliken charges:
elementType: S O O N C C C C C C C C C C C C C C C C H H H H H H H H H H H H H
charge: 0.229840 -0.291966 -0.194701 -0.008506 0.269478 -0.354697 -0.376474 0.522502 0.308657 -0.305935 -0.384260 -0.352492 0.443114 -0.370515 -0.347830 -0.423538 -0.210998 -0.807068 0.252912 -0.748423 0.248216 0.269236 0.232250 0.252122 0.233062 0.233741 0.232724 0.236234 0.232994 0.226877 0.251156 0.245229 0.257060
chargesum: 0.00000
title: Mulliken charges with hydrogens summed into heavy atoms:
elementType: S O O N C C C C C C C C C C C C C C C C
charge: 0.229840 -0.291966 -0.194701 -0.008506 0.269478 -0.354697 -0.376474 0.522502 0.308657 -0.057719 -0.115023 -0.120243 0.443114 -0.118393 -0.114768 -0.189797 0.021725 -0.110963 0.252912 0.005021
polarizability: 3.57520426e+02 -2.64024333e+01 2.23826512e+02 -7.29074946e+00 -9.61408564e+00 9.73450891e+01
1716.lowfreq: -44.7730 -0.0022 -0.0019 -0.0013 3.8092 5.7810 7.1325 29.1658 40.5780
frequency: -44.6920 29.1479 40.5662 47.8814 58.1239 77.7697 84.6234 91.0959 120.0308 178.9557 222.8593 225.4848 244.9294 273.4809 302.9147 332.3317 355.3478 381.9233 401.5639 403.0030 480.1935 494.8118 518.3676 529.5921 549.1285 551.4375 564.2129 613.7091 616.5896 632.5892 655.1818 672.9768 724.5453 743.0177 769.1681 780.4306 804.4739 831.4263 840.7759 852.7157 882.5756 897.1812 933.4248 961.4485 966.4215 986.6173 988.5609 989.9914 1012.9194 1038.6760 1046.6695 1055.0203 1126.2852 1142.3922 1159.8132 1177.6951 1188.8787 1200.0172 1226.3853 1226.9728 1284.5117 1312.1467 1366.3423 1370.4055 1382.0734 1397.5903 1414.0750 1421.3726 1452.3460 1452.8397 1456.0258 1468.1681 1471.9363 1488.3106 1532.5394 1567.6576 1575.4311 1605.4201 1622.4305 1693.6695 2977.9984 3008.5033 3056.0711 3087.8254 3098.7310 3122.1165 3125.5909 3144.4725 3145.1696 3146.5563 3165.4854 3166.0335 3178.4195
redmass: 1.0255 3.7965 5.5231 3.2694 2.7718 6.1620 1.5042 4.5517 4.8130 8.9229 6.7917 4.8357 5.5387 4.7923 3.7501 3.7256 5.2895 5.4893 2.8279 7.6569 3.3036 5.3224 6.8360 4.4656 4.4449 3.5878 4.7482 5.6553 7.1935 7.0330 7.8920 7.2925 2.8475 3.0388 2.6146 3.6647 3.3510 1.4692 6.4501 1.2937 5.9795 1.4944 6.9949 1.3654 1.3356 1.6993 1.6828 1.3912 2.8185 1.6504 1.5723 1.9332 1.3766 3.7289 2.2900 1.4789 2.0004 1.6016 2.9538 2.0501 3.5984 1.2927 4.2599 3.9673 1.2396 1.2418 3.7377 4.4015 1.0494 1.0660 2.9123 1.0478 1.1212 3.2227 5.9056 6.7661 6.1213 8.3844 6.3782 10.5391 1.0374 1.0372 1.0972 1.0989 1.0961 1.0873 1.0897 1.1017 1.0965 1.0868 1.0929 1.0952 1.0989
irintensity: 0.4667 0.0582 0.3116 2.4575 2.6929 4.0485 0.4474 1.7869 1.0370 0.5152 0.5619 0.6568 1.2894 1.9867 1.9480 0.3852 0.2313 7.2208 0.0632 1.6621 14.3735 6.3461 2.7455 1.5542 6.6572 7.1773 3.0023 3.3521 14.2551 3.2539 16.2127 2.7508 3.9180 39.4511 31.3766 4.8708 59.2320 40.2227 8.4821 10.8274 28.0591 3.8217 86.0085 1.2361 2.3365 41.1584 70.8684 9.9951 4.8133 9.4796 13.7212 10.5240 2.5543 179.5145 255.9901 6.4216 59.9492 3.6845 2.1538 18.5823 21.0253 3.8124 0.6484 4.2732 62.5879 11.2521 7.5428 11.9140 17.4925 26.1439 34.0665 13.8051 15.9070 99.2850 26.2788 20.2845 9.5097 19.1879 53.4629 163.1821 37.9331 1.5658 18.5572 19.3059 8.0253 16.1211 21.4130 9.3259 16.5127 2.9332 6.1503 5.2661 16.4458
temp: 298.150 k
press: 1.00000 atm
elementType: 16 8 8 7 6 6 6 6 6 6 6 6 6 6 6 6 6 6 6 6 1 1 1 1 1 1 1 1 1 1 1 1 1
symmnumber: 1
zpe: 646363.8 jmol-1
zpe.correction: 0.246187 hartree
zpe.thermalcorrener: 0.263637 hartree
zpe.thermalcorrenthalpy: 0.264582 hartree
zpe.thermalcorrgfe: 0.198880 hartree
zpe.sumelectzpe: -1219.389046 hartree
zpe.sumelectthermal: -1219.371596 hartree
zpe.sumelectthermalent: -1219.370651 hartree
zpe.sumelectthermalfe: -1219.436353 hartree
dipole: -1.4294 0.1074 -1.4382
dipole: 2.0306
quadrupole: -94.3057 -105.0572 -133.8388
quadrupole: -3.7663 -3.0578 -5.2490
quadrupole: 16.7615 6.0101 -22.7716 -3.7663 -3.0578 -5.2490
hfenergy: -1219.635233 hartree
pointgroup: C01 [X(C16H13N1O2S1)]
dipole: -0.5575801 -0.0890288 0.5651766 debye
polarizability: 353.4320501|34.9222182|228.2017493|8.1607019|-6.9895799|97.0582276 unknown
InChI: InChI=1S/C16H13NO2S/c1-10-6-8-12(9-7-10)16-17-15-13(19-11(2)18)4-3-5-14(15)20-16/h3-9H,1-2H3
charge 0 multiplicity 1
33 atoms
S  -0.214912 2.547067 -0.177114
O  3.073427 -1.299563 0.55848
O  2.310021 -1.917751 -1.578331
N  0.422845 -0.048888 0.199149
C  1.629763 0.656089 0.156568
C  1.522951 2.073758 -0.027245
C  -0.632304 0.731549 0.045963
C  -2.027048 0.284323 0.033522
C  2.922568 0.088794 0.297101
C  2.655773 2.909089 -0.063617
C  -2.308963 -1.109634 0.122145
C  -3.113992 1.192572 -0.064309
C  -4.730678 -0.664797 0.013045
C  4.061234 0.907561 0.2679
C  -3.636823 -1.568583 0.111984
C  -4.44211 0.721484 -0.073613
C  3.925827 2.309208 0.090076
C  -6.159368 -1.175182 -0.006966
C  2.635757 -2.241254 -0.426092
C  2.664016 -3.624854 0.176099
H  2.563843 3.989709 -0.20388
H  -1.468819 -1.807217 0.192512
H  -2.925633 2.270968 -0.12973
H  5.046745 0.4473 0.383775
H  -3.8354 -2.645244 0.178893
H  -5.267677 1.438763 -0.148753
H  4.823476 2.935485 0.067875
H  -6.346272 -1.801486 -0.899973
H  -6.374097 -1.802662 0.878121
H  -6.887109 -0.346174 -0.019814
H  3.605254 -3.788695 0.726127
H  2.545075 -4.379437 -0.614581
H  1.836929 -3.720698 0.902285
