program: Gaussian 09
title: 000129786
version: EM64L-G09RevD.01
frameworkgroup: C1[X(C19H21N7O2)]
method: RPBEPBE
basis: SDD
operation: Freq
keyword: #p
keyword: freq=noraman
keyword: PBEPBE/SDD
title: #p freq=noraman PBEPBE/SDD
converged: YES YES NO NO
title: Mulliken charges:
elementType: O O N N N N N N N C C C C C C C C C C C C C C C C C C C H H H H H H H H H H H H H H H H H H H H H
charge: -0.214711 -0.254040 -0.068230 -0.121313 -0.326047 -0.658371 -0.434273 -0.397344 0.064177 -0.345537 -0.379912 -0.419535 -0.396150 -0.425837 0.168644 0.184553 0.337112 0.002639 0.180006 0.351819 -0.356207 0.001491 -0.357018 -0.319527 -0.220114 -0.234773 -0.137073 -0.371895 0.249804 0.183743 0.223996 0.201758 0.230105 0.204107 0.248238 0.216721 0.221138 0.244486 0.271547 0.312535 0.310244 0.329538 0.280398 0.207600 0.247283 0.238515 0.239604 0.235523 0.250583
chargesum: 0.00000
title: Mulliken charges with hydrogens summed into heavy atoms:
elementType: O O N N N N N N N C C C C C C C C C C C C C C C C C C C
charge: -0.214711 -0.254040 -0.068230 -0.121313 -0.326047 -0.035593 -0.104735 -0.189743 0.064177 0.088010 0.045842 0.014677 0.068809 0.039787 0.168644 0.184553 0.337112 0.002639 0.180006 0.351819 -0.084660 0.001491 -0.076620 -0.072244 0.018402 0.004831 0.098450 -0.121312
polarizability: 2.58507137e+02 2.98938515e+01 2.89296052e+02 5.49477804e-02 4.14381171e+00 2.36319233e+02
1716.lowfreq: -3.5551 -1.8810 -0.0007 -0.0004 0.0003 3.8202 15.7632 26.7583 30.5966
frequency: 15.6459 26.6891 30.5530 43.0893 56.3668 62.7732 80.6556 87.1969 92.9809 112.2113 130.5356 150.9680 178.0971 198.4223 208.0893 241.7042 272.8176 297.5159 313.0599 320.9055 330.2465 348.3958 359.1641 366.6344 375.3282 385.7085 399.7651 415.3914 419.0121 434.2563 460.2130 470.9872 492.4822 508.6699 520.7473 538.8178 556.4358 592.7274 597.7724 602.8916 623.2017 630.8661 650.6434 667.3559 667.7896 699.2278 719.2066 733.4080 735.8206 754.8474 760.4905 775.6647 789.1113 791.1446 805.5630 835.8864 853.4700 894.0965 906.8393 918.4754 928.9256 962.0989 970.6884 973.6839 974.1276 990.4982 1000.7304 1007.1621 1028.6256 1031.5497 1051.1037 1051.6182 1062.2895 1076.1069 1083.9275 1101.7813 1122.7802 1128.7895 1139.0333 1159.1439 1173.9896 1176.4140 1192.5970 1206.2087 1214.8932 1238.7597 1247.3969 1261.2232 1264.6222 1290.8449 1297.9570 1299.8209 1317.5962 1317.6965 1333.0814 1336.4720 1345.9395 1360.1520 1371.9325 1376.9788 1387.4205 1397.6530 1419.9828 1433.4910 1435.4698 1441.1637 1447.7142 1449.9501 1459.5845 1462.2363 1471.0509 1472.9569 1557.3729 1570.9141 1580.3299 1597.2766 1603.2001 1608.3415 1626.7061 1628.1379 2816.7979 2850.3826 2890.0705 2992.9062 3002.7834 3018.8639 3023.7258 3069.0212 3092.3391 3103.4479 3134.6133 3137.9043 3145.6558 3150.6988 3161.6264 3173.1193 3173.9843 3374.6177 3486.8521 3537.4839 3690.2184
redmass: 5.8377 4.4699 4.7943 6.1935 5.5122 6.0259 5.6232 4.6396 4.6829 5.4242 4.6161 5.2077 4.6245 2.8929 4.1133 4.3309 5.8578 2.1306 3.3246 5.2082 2.9006 5.4428 6.7837 4.4509 1.4314 1.2693 2.0820 2.1999 6.9214 3.8930 2.8205 4.0267 3.5281 3.9286 4.1399 3.8831 3.5767 2.7834 5.1806 4.5583 3.7435 2.2867 5.2643 5.7203 5.7653 4.7927 2.5157 2.2802 1.3085 2.6349 4.6758 3.4149 2.0845 3.2460 1.6604 1.6137 4.4308 1.6245 2.9298 1.6256 2.4355 5.7595 2.7161 1.4371 1.4320 2.1238 1.3504 2.5159 2.2755 2.6778 1.7833 2.2556 1.5825 1.6014 3.1705 2.0479 1.9030 2.8098 2.1924 2.2324 1.0664 2.3740 2.6400 1.1278 1.9012 1.8769 1.5415 2.7561 1.6781 1.5338 2.1741 1.9634 4.9396 1.6659 2.9323 1.4554 1.2404 1.3891 1.4084 9.9655 1.4515 1.8452 1.7101 1.1884 1.2126 2.1234 2.4744 3.1773 1.1752 1.3321 1.5788 1.5743 7.0473 5.7146 6.7375 1.9842 5.4282 5.2165 2.3299 4.2441 1.0707 1.0705 1.0681 1.0665 1.0649 1.0835 1.0907 1.0888 1.0983 1.0974 1.0892 1.0862 1.0912 1.0900 1.0952 1.1000 1.1005 1.0763 1.0750 1.0456 1.1026
irintensity: 1.3356 0.7224 1.2832 2.0714 0.2934 1.8047 4.7384 6.8805 5.2483 2.8630 1.4137 1.4543 0.5917 3.0296 1.6515 3.1118 2.7119 11.3394 17.1270 12.1494 12.9661 1.3689 6.3443 30.8398 176.1348 30.7084 46.4924 15.0775 1.6235 3.8296 5.4478 4.1427 8.4509 8.0642 3.5135 1.4286 22.9329 6.2877 7.8056 2.2187 7.6463 28.6573 17.9034 2.0764 18.4915 3.3394 18.6679 90.8277 58.0418 18.0409 0.5206 26.3126 15.1920 20.0401 50.3840 0.0671 10.9858 0.2868 12.5968 6.0170 1.5145 7.4087 24.6731 0.0544 0.8659 7.1086 0.9351 127.3572 23.1286 9.7683 5.8899 0.2856 25.3534 80.0555 5.7857 31.5891 72.8304 33.3583 102.0841 123.7358 2.7328 11.8308 3.8593 21.1180 62.2054 79.7323 7.7453 178.3267 9.1178 25.2569 26.9391 4.0598 49.2420 68.7922 191.6724 32.2885 1.2731 9.4154 5.2462 10.8151 19.0803 41.4477 114.3938 49.8034 1.8933 36.4914 6.7194 246.7875 22.7520 27.4658 4.8011 51.6796 34.8331 35.9888 23.4608 246.8539 123.1808 271.2372 68.7027 231.3381 95.5653 67.0577 53.2623 30.5976 49.4827 15.2765 67.9817 11.4007 20.9937 3.1985 3.6064 2.4864 12.0098 8.1118 4.7616 28.2487 15.4090 21.6783 31.7779 18.7243 19.8859
temp: 298.150 k
press: 1.00000 atm
elementType: 8 8 7 7 7 7 7 7 7 6 6 6 6 6 6 6 6 6 6 6 6 6 6 6 6 6 6 6 1 1 1 1 1 1 1 1 1 1 1 1 1 1 1 1 1 1 1 1 1
symmnumber: 1
zpe: 1015966.5 jmol-1
zpe.correction: 0.386961 hartree
zpe.thermalcorrener: 0.411324 hartree
zpe.thermalcorrenthalpy: 0.412269 hartree
zpe.thermalcorrgfe: 0.331137 hartree
zpe.sumelectzpe: -1268.300271 hartree
zpe.sumelectthermal: -1268.275907 hartree
zpe.sumelectthermalent: -1268.274963 hartree
zpe.sumelectthermalfe: -1268.356095 hartree
dipole: -3.0233 -0.5886 1.3964
dipole: 3.3818
quadrupole: -135.8757 -154.4943 -160.3505
quadrupole: -2.9616 12.0525 -18.7833
quadrupole: 14.3645 -4.2541 -10.1103 -2.9616 12.0525 -18.7833
hfenergy: -1268.6872318 hartree
pointgroup: C01 [X(C19H21N7O2)]
dipole: -1.1719929 0.4012647 -0.4854113 debye
polarizability: 253.2988985|-26.3105571|292.5775284|-3.1406769|11.3851612|238.2459959 unknown
InChI: InChI=1S/C19H21N7O2/c20-19(21)25-10-8-24(9-11-25)12-16(27)26-15-6-2-1-4-13(15)18(28)23-14-5-3-7-22-17(14)26/h1-7,20,23H,8-12,21H2
charge 0 multiplicity 1
49 atoms
O  0.221782 1.98295 0.889379
O  -2.367935 -0.953099 -3.161781
N  2.348702 0.074476 0.819277
N  5.147712 0.268093 0.106355
N  -1.423761 0.350451 0.676634
N  6.460868 0.456282 -1.845929
N  -2.779722 0.851323 -1.796682
N  6.174166 -1.689931 -0.731692
N  -2.754467 2.033973 1.749998
C  2.760427 0.793433 -0.412612
C  3.291464 -1.034459 1.137711
C  4.196104 1.344617 -0.254431
C  4.718738 -0.477501 1.307867
C  0.957687 -0.385248 0.795271
C  -0.070837 0.763468 0.811171
C  5.947888 -0.390474 -0.840871
C  -1.861496 -1.010995 0.483955
C  -2.45594 1.355928 0.618824
C  -2.356423 -1.417218 -0.786639
C  -3.099659 1.58809 -0.629845
C  -1.81214 -1.93277 1.555528
C  -2.46938 -0.509959 -1.976595
C  -2.741089 -2.770285 -0.975952
C  -4.054212 2.636457 -0.690211
C  -2.210681 -3.271122 1.35753
C  -2.668286 -3.693382 0.085499
C  -4.337092 3.375859 0.474933
C  -3.677081 3.032507 1.678314
H  2.068545 1.637041 -0.571961
H  2.723544 0.120228 -1.308233
H  3.306411 -1.816293 0.339415
H  2.969709 -1.510651 2.083737
H  4.194601 2.103292 0.551296
H  4.503149 1.823655 -1.197872
H  5.427652 -1.303789 1.469758
H  4.732681 0.21862 2.168958
H  0.724609 -1.043534 -0.084645
H  0.788534 -1.012654 1.690977
H  -1.470402 -1.585476 2.535925
H  6.918671 0.038246 -2.65082
H  6.622566 1.444708 -1.663161
H  -2.925358 1.326865 -2.694771
H  -3.083301 -3.072893 -1.970558
H  6.929596 -2.019755 -1.360677
H  -4.565748 2.85892 -1.633869
H  -2.166722 -3.980684 2.190684
H  -2.971249 -4.733492 -0.072496
H  -5.064871 4.192647 0.457913
H  -3.879957 3.568535 2.611194
